{"text_format":"3","workbook":"xlsx","n_sheets":6,"sheets":["Chart","Data","Yerms","Rules","Zoom","Labels"],"not_rendered":{"charts":1,"macros":1,"defined_names":19},"read":"whole","date_system":"1900"}

{"sheet":"Chart","index":0,"n_rows":19,"n_cols":17,"rows_kept":19}
[{"$f":"MPC&\"-Month, \"&Yerms&\"-Yerm Lunar Cycle Jitter\"","v":"801-Month, 49-Yerm Lunar Cycle Jitter"}]
[{"$f":"\"Cycle contains \"&MPC&\" months (\"&FMPC&\" full, \"&DMPC&\" deficient) = \"&DPC&\" days = \"&reducefraction(DPC,7,FALSE,FALSE,TRUE)&\" weeks = \"&Yerms&\" yerms.\"","v":"Cycle contains 801 months (425 full, 376 deficient) = 23654 days = 3379+1/7 weeks = 49 yerms."}]
[{"$f":"\"Mean month = \"&\"29+\"&reducefraction(FMPC,MPC,FALSE,FALSE,TRUE)&\" days = 29d 12h 44m \"&reducefraction(240*(360*FMPC-191*MPC),MPC,FALSE,FALSE,TRUE)&\" seconds, or about 29\"&MID(FMPC/MPC,2,20)&\" days or 29d 12h 44m \"&ROUND(240*(360*FMPC-191*MPC)/MPC,6)&\" seconds.\"","v":"Mean month = 29+425/801 days = 29d 12h 44m 2+62/89 seconds, or about 29.530586766541823 days or 29d 12h 44m 2.696629 seconds."}]
[{"$f":"\"Duration per ''Part'' = 1/\"&MPC&\" day = \"&reducefraction(24,MPC,FALSE,FALSE,TRUE)&\" hour = \"&reducefraction(1440,MPC,FALSE,FALSE,TRUE)&\" minutes = \"&reducefraction(86400,MPC,FALSE,FALSE,TRUE)&\" seconds.  One hour = \"&reducefraction(MPC,24,FALSE,FALSE,TRUE)&\" parts.\"","v":"Duration per ''Part'' = 1/801 day = 8/267 hour = 1+71/89 minutes = 107+77/89 seconds.  One hour = 33+3/8 parts."}]
[]
[]
[]
[]
[{"$nulls":16},false]
[]
[]
[]
[]
[]
[{"$nulls":16},1]
[{"$nulls":16},"Selected"]
[{"$nulls":16},"Month"]
[{"$nulls":16},"in Yerm"]
[{"$nulls":16},"(1 to 17)"]

{"sheet":"Data","index":1,"n_rows":838,"n_cols":8,"rows_kept":838}
["Lunar Cycle Jitter Evaluator"]
["by Dr. Irv Bromberg, University of Toronto, Canada"]
["http://individual.utoronto.ca/intervalmath/jitter/index.html",null,null,"Jitter","(parts)"]
[{"$nulls":3},{"$f":"MAX(H:H)","v":408},"maximum",{"$f":"reducefraction(JitterMax*MPC,MPC,FALSE,FALSE,FALSE)","v":"408"}]
["Months per Cycle (Parts per Day):",801,"months (parts)",{"$f":"MIN(H:H)","v":-392},"minimum",{"$f":"reducefraction(JitterMin*MPC,MPC,FALSE,FALSE,FALSE)","v":"–(392)"}]
["30-day Months per Cycle:",425,"months",{"$f":"D4-D5","v":800},"range",{"$f":"reducefraction(JitterRange*MPC,MPC,FALSE,FALSE,FALSE)","v":"800"}]
["29-day Months per Cycle:",{"$f":"MPC-FMPC","v":376},"months",{"$f":"\"Jitter range = \"&F6&\" parts = \"&reducefraction(F6*24,MPC,FALSE,FALSE,FALSE)&\" hours\"","v":"Jitter range = 800 parts = 23 + 259 / 267 hours"}]
["Days per Cycle (Parts per Month):",{"$f":"29*MPC+FMPC","v":23654},"days (parts)"]
["Yerms per Cycle:",{"$f":"2*DPC-59*MPC","v":49},"yerms","Limits for Chart:"]
["Mean Month:",{"$f":"\"29 + \"&reducefraction(FMPC,MPC,FALSE,FALSE,FALSE)","v":"29 + 425 / 801"},"days","x","y","Hours"]
["Mean Month >29d:",{"$f":"FMPC/MPC","v":{"v":0.5305867665418227,"d":"0.530586766541823"}},"days",{"$f":"C21","v":1},{"$f":"JitterMax","v":408},{"$f":"E11*24/MPC","v":12.224719101123595}]
["Mean Month >29d 12h 44m:",{"$f":"reducefraction(240*(360*FMPC-191*MPC),MPC,FALSE,FALSE,TRUE)","v":"2+62/89"},"seconds",{"$f":"MPC+1","v":802},{"$f":"E11","v":408},{"$f":"E12*24/MPC","v":12.224719101123595}]
["… or approximately:",{"$f":"240*(360*FMPC-191*MPC)/MPC","v":2.696629213483146},"seconds"]
["Has Yerm Zero:",{"$f":"MeanMonth>26/49","v":false},null,{"$f":"D11","v":1},0]
["17-month Yerms per Cycle:",{"$f":"443*MPC-15*DPC","v":33},"yerms",{"$f":"D12","v":802},0]
["15-month Yerms per Cycle:",{"$f":"Yerms-n17my","v":16},"yerms"]
["49-month subcycles:",{"$f":"INT(Yerms/3)","v":16},null,{"$f":"C21","v":1},{"$f":"JitterMin","v":-392},{"$f":"E17*24/MPC","v":-11.745318352059925}]
["Duration per Part:",{"$f":"reducefraction(1440,MPC,FALSE,FALSE,FALSE)","v":"1 + 71 / 89"},"minutes",{"$f":"D12","v":802},{"$f":"E17","v":-392},{"$f":"E18*24/MPC","v":-11.745318352059925}]
[]
["Yerm in Cycle","Months in Yerm","Month #","Month in Yerm","Month Length","New Month Moment","Elapsed","Difference"]
[1,{"$f":"IF(MOD(A21,3)=0,15,17)","v":17},1,1,{"$f":"IF(MOD(D21,2)=1,30,29)","v":30},0,0,{"$f":"F21-G21","v":0}]
[{"$f":"IF(D22=1,IF(A21=Yerms,1,A21+1),A21)","v":1},{"$f":"IF(MOD(A22,3)=0,15,17)","v":17},{"$f":"C21+1","v":2},{"$f":"IF(D21=B21,1,D21+1)","v":2},{"$f":"IF(MOD(D22,2)=1,30,29)","v":29},{"$f":"F21+PPM","v":23654},{"$f":"G21+E21*PPD","v":24030},-376]
[1,17,{"$f":"C22+1","v":3},3,30,{"$f":"F22+PPM","v":47308},47259,49]
[1,17,4,4,29,70962,71289,-327]
[1,17,5,5,30,94616,94518,98]
[1,17,6,6,29,118270,118548,-278]
[1,17,7,7,30,141924,141777,147]
[1,17,8,8,29,165578,165807,-229]
[1,17,9,9,30,189232,189036,196]
[1,17,10,10,29,212886,213066,-180]
[1,17,11,11,30,236540,236295,245]
[1,17,12,12,29,260194,260325,-131]
[1,17,13,13,30,283848,283554,294]
[1,17,14,14,29,307502,307584,-82]
[1,17,15,15,30,331156,330813,343]
[1,17,16,16,29,354810,354843,-33]
[1,{"$f":"IF(MOD(A37,3)=0,15,17)","v":17},17,17,30,378464,378072,392]
[2,17,18,1,30,402118,402102,16]
[2,17,19,2,29,425772,426132,-360]
[2,17,20,3,30,449426,449361,65]
[2,17,21,4,29,473080,473391,-311]
[2,17,22,5,30,496734,496620,114]
[2,17,23,6,29,520388,520650,-262]
[2,17,24,7,30,544042,543879,163]
[2,17,25,8,29,567696,567909,-213]
[2,17,26,9,30,591350,591138,212]
[2,17,27,10,29,615004,615168,-164]
[2,17,28,11,30,638658,638397,261]
[2,17,29,12,29,662312,662427,-115]
[2,17,30,13,30,685966,685656,310]
[2,17,31,14,29,709620,709686,-66]
[2,17,32,15,30,733274,732915,359]
[2,17,33,16,29,756928,756945,-17]
[2,17,34,17,30,780582,780174,408]
[3,15,35,1,30,804236,804204,32]
[3,15,36,2,29,827890,828234,-344]
[3,15,37,3,30,851544,851463,81]
[3,15,38,4,29,875198,875493,-295]
[3,15,39,5,30,898852,898722,130]
[3,15,40,6,29,922506,922752,-246]
[3,15,41,7,30,946160,945981,179]
[3,15,42,8,29,969814,970011,-197]
[3,15,43,9,30,993468,993240,228]
[3,15,44,10,29,1017122,1017270,-148]
[3,15,45,11,30,1040776,1040499,277]
[3,15,46,12,29,1064430,1064529,-99]
[3,15,47,13,30,1088084,1087758,326]
[3,15,48,14,29,1111738,1111788,-50]
[3,15,49,15,30,1135392,1135017,375]
[4,17,50,1,30,1159046,1159047,-1]
[4,17,51,2,29,1182700,1183077,-377]
[4,17,52,3,30,1206354,1206306,48]
[4,17,53,4,29,1230008,1230336,-328]
[4,17,54,5,30,1253662,1253565,97]
[4,17,55,6,29,1277316,1277595,-279]
[4,17,56,7,30,1300970,1300824,146]
[4,17,57,8,29,1324624,1324854,-230]
[4,17,58,9,30,1348278,1348083,195]
[4,17,59,10,29,1371932,1372113,-181]
[4,17,60,11,30,1395586,1395342,244]
[4,17,61,12,29,1419240,1419372,-132]
[4,17,62,13,30,1442894,1442601,293]
[4,17,63,14,29,1466548,1466631,-83]
[4,17,64,15,30,1490202,1489860,342]
[4,17,65,16,29,1513856,1513890,{"$f":"F85-G85","v":-34}]
[{"$f":"IF(D86=1,IF(A85=Yerms,1,A85+1),A85)","v":4},{"$f":"IF(MOD(A86,3)=0,15,17)","v":17},66,{"$f":"IF(D85=B85,1,D85+1)","v":17},{"$f":"IF(MOD(D86,2)=1,30,29)","v":30},1537510,{"$f":"G85+E85*PPD","v":1537119},391]
[5,17,{"$f":"C86+1","v":67},1,30,{"$f":"F86+PPM","v":1561164},1561149,15]
[5,17,68,2,29,1584818,1585179,-361]
[5,17,69,3,30,1608472,1608408,64]
[5,17,70,4,29,1632126,1632438,-312]
[5,17,71,5,30,1655780,1655667,113]
[5,17,72,6,29,1679434,1679697,-263]
[5,17,73,7,30,1703088,1702926,162]
[5,17,74,8,29,1726742,1726956,-214]
[5,17,75,9,30,1750396,1750185,211]
[5,17,76,10,29,1774050,1774215,-165]
[5,17,77,11,30,1797704,1797444,260]
[5,17,78,12,29,1821358,1821474,-116]
[5,17,79,13,30,1845012,1844703,309]
[5,17,80,14,29,1868666,1868733,-67]
[5,17,81,15,30,1892320,1891962,358]
[5,17,82,16,29,1915974,1915992,-18]
[5,17,83,17,30,1939628,1939221,407]
[6,15,84,1,30,1963282,1963251,31]
[6,15,85,2,29,1986936,1987281,-345]
[6,15,86,3,30,2010590,2010510,80]
[6,15,87,4,29,2034244,2034540,-296]
[6,15,88,5,30,2057898,2057769,129]
[6,15,89,6,29,2081552,2081799,-247]
[6,15,90,7,30,2105206,2105028,178]
[6,15,91,8,29,2128860,2129058,-198]
[6,15,92,9,30,2152514,2152287,227]
[6,15,93,10,29,2176168,2176317,-149]
[6,15,94,11,30,2199822,2199546,276]
[6,15,95,12,29,2223476,2223576,-100]
[6,15,96,13,30,2247130,2246805,325]
[6,15,97,14,29,2270784,2270835,-51]
[6,15,98,15,30,2294438,2294064,374]
[7,17,99,1,30,2318092,2318094,-2]
[7,17,100,2,29,2341746,2342124,-378]
[7,17,101,3,30,2365400,2365353,47]
[7,17,102,4,29,2389054,2389383,-329]
[7,17,103,5,30,2412708,2412612,96]
[7,17,104,6,29,2436362,2436642,-280]
[7,17,105,7,30,2460016,2459871,145]
[7,17,106,8,29,2483670,2483901,-231]
[7,17,107,9,30,2507324,2507130,194]
[7,17,108,10,29,2530978,2531160,-182]
[7,17,109,11,30,2554632,2554389,243]
[7,17,110,12,29,2578286,2578419,-133]
[7,17,111,13,30,2601940,2601648,292]
[7,17,112,14,29,2625594,2625678,-84]
[7,17,113,15,30,2649248,2648907,341]
[7,17,114,16,29,2672902,2672937,-35]
[7,17,115,17,30,2696556,2696166,390]
[8,17,116,1,30,2720210,2720196,14]
[8,17,117,2,29,2743864,2744226,-362]
[8,17,118,3,30,2767518,2767455,63]
[8,17,119,4,29,2791172,2791485,-313]
[8,17,120,5,30,2814826,2814714,112]
[8,17,121,6,29,2838480,2838744,-264]
[8,17,122,7,30,2862134,2861973,161]
[8,17,123,8,29,2885788,2886003,-215]
[8,17,124,9,30,2909442,2909232,210]
[8,17,125,10,29,2933096,2933262,-166]
[8,17,126,11,30,2956750,2956491,259]
[8,17,127,12,29,2980404,2980521,-117]
[8,17,128,13,30,3004058,3003750,308]
[8,17,129,14,29,3027712,3027780,{"$f":"F149-G149","v":-68}]
[{"$f":"IF(D150=1,IF(A149=Yerms,1,A149+1),A149)","v":8},{"$f":"IF(MOD(A150,3)=0,15,17)","v":17},130,{"$f":"IF(D149=B149,1,D149+1)","v":15},{"$f":"IF(MOD(D150,2)=1,30,29)","v":30},3051366,{"$f":"G149+E149*PPD","v":3051009},357]
[8,17,{"$f":"C150+1","v":131},16,29,{"$f":"F150+PPM","v":3075020},3075039,-19]
[8,17,132,17,30,3098674,3098268,406]
[9,15,133,1,30,3122328,3122298,30]
[9,15,134,2,29,3145982,3146328,-346]
[9,15,135,3,30,3169636,3169557,79]
[9,15,136,4,29,3193290,3193587,-297]
[9,15,137,5,30,3216944,3216816,128]
[9,15,138,6,29,3240598,3240846,-248]
[9,15,139,7,30,3264252,3264075,177]
[9,15,140,8,29,3287906,3288105,-199]
[9,15,141,9,30,3311560,3311334,226]
[9,15,142,10,29,3335214,3335364,-150]
[9,15,143,11,30,3358868,3358593,275]
[9,15,144,12,29,3382522,3382623,-101]
[9,15,145,13,30,3406176,3405852,324]
[9,15,146,14,29,3429830,3429882,-52]
[9,15,147,15,30,3453484,3453111,373]
[10,17,148,1,30,3477138,3477141,-3]
[10,17,149,2,29,3500792,3501171,-379]
[10,17,150,3,30,3524446,3524400,46]
[10,17,151,4,29,3548100,3548430,-330]
[10,17,152,5,30,3571754,3571659,95]
[10,17,153,6,29,3595408,3595689,-281]
[10,17,154,7,30,3619062,3618918,144]
[10,17,155,8,29,3642716,3642948,-232]
[10,17,156,9,30,3666370,3666177,193]
[10,17,157,10,29,3690024,3690207,-183]
[10,17,158,11,30,3713678,3713436,242]
[10,17,159,12,29,3737332,3737466,-134]
[10,17,160,13,30,3760986,3760695,291]
[10,17,161,14,29,3784640,3784725,-85]
[10,17,162,15,30,3808294,3807954,340]
[10,17,163,16,29,3831948,3831984,-36]
[10,17,164,17,30,3855602,3855213,389]
[11,17,165,1,30,3879256,3879243,13]
[11,17,166,2,29,3902910,3903273,-363]
[11,17,167,3,30,3926564,3926502,62]
[11,17,168,4,29,3950218,3950532,-314]
[11,17,169,5,30,3973872,3973761,111]
[11,17,170,6,29,3997526,3997791,-265]
[11,17,171,7,30,4021180,4021020,160]
[11,17,172,8,29,4044834,4045050,-216]
[11,17,173,9,30,4068488,4068279,209]
[11,17,174,10,29,4092142,4092309,-167]
[11,17,175,11,30,4115796,4115538,258]
[11,17,176,12,29,4139450,4139568,-118]
[11,17,177,13,30,4163104,4162797,307]
[11,17,178,14,29,4186758,4186827,-69]
[11,17,179,15,30,4210412,4210056,356]
[11,17,180,16,29,4234066,4234086,-20]
{"$rows_left_out":639}
{"sheet":"Yerms","index":2,"n_rows":51,"n_cols":7,"rows_kept":51}
["Month in Cycle","Yerm","New Yerm Moment","Elapsed","Difference","Top","Yerm Start"]
[{"$f":"StartMonth","v":1},1,{"$f":"(A2-1)*PPM","v":0},{"$f":"LOOKUP(A2,Data!C$21:C$838,Data!G$21:G$838)","v":0},{"$f":"IF(AND(StartMonth>15,MOD(B2,3)=0),NA(),C2-D2)","v":0},1200,{"$f":"A2-StartMonth+1","v":1}]
[{"$f":"A2+IF(MOD(B2,3)=0,15,17)","v":18},{"$f":"MOD(B2,Yerms)+1","v":2},{"$f":"(A3-1)*PPM","v":402118},{"$f":"LOOKUP(A3,Data!C$21:C$838,Data!G$21:G$838)","v":402102},16,{"$f":"F2","v":1200},18]
[{"$f":"A3+IF(MOD(B3,3)=0,15,17)","v":35},{"$f":"MOD(B3,Yerms)+1","v":3},{"$f":"(A4-1)*PPM","v":804236},{"$f":"LOOKUP(A4,Data!C$21:C$838,Data!G$21:G$838)","v":804204},32,{"$f":"F3","v":1200},35]
[50,4,1159046,{"$f":"LOOKUP(A5,Data!C$21:C$838,Data!G$21:G$838)","v":1159047},-1,1200,50]
[67,5,1561164,{"$f":"LOOKUP(A6,Data!C$21:C$838,Data!G$21:G$838)","v":1561149},15,1200,67]
[84,6,1963282,{"$f":"LOOKUP(A7,Data!C$21:C$838,Data!G$21:G$838)","v":1963251},31,1200,84]
[99,7,2318092,{"$f":"LOOKUP(A8,Data!C$21:C$838,Data!G$21:G$838)","v":2318094},-2,1200,99]
[116,8,2720210,{"$f":"LOOKUP(A9,Data!C$21:C$838,Data!G$21:G$838)","v":2720196},14,1200,116]
[133,9,3122328,{"$f":"LOOKUP(A10,Data!C$21:C$838,Data!G$21:G$838)","v":3122298},30,1200,133]
[148,10,3477138,{"$f":"LOOKUP(A11,Data!C$21:C$838,Data!G$21:G$838)","v":3477141},-3,1200,148]
[165,11,3879256,{"$f":"LOOKUP(A12,Data!C$21:C$838,Data!G$21:G$838)","v":3879243},13,1200,165]
[182,12,4281374,{"$f":"LOOKUP(A13,Data!C$21:C$838,Data!G$21:G$838)","v":4281345},29,1200,182]
[197,13,4636184,{"$f":"LOOKUP(A14,Data!C$21:C$838,Data!G$21:G$838)","v":4636188},-4,1200,197]
[214,14,5038302,{"$f":"LOOKUP(A15,Data!C$21:C$838,Data!G$21:G$838)","v":5038290},12,1200,214]
[231,15,5440420,{"$f":"LOOKUP(A16,Data!C$21:C$838,Data!G$21:G$838)","v":5440392},28,1200,231]
[246,16,5795230,{"$f":"LOOKUP(A17,Data!C$21:C$838,Data!G$21:G$838)","v":5795235},-5,1200,246]
[263,17,6197348,{"$f":"LOOKUP(A18,Data!C$21:C$838,Data!G$21:G$838)","v":6197337},11,1200,263]
[280,18,6599466,{"$f":"LOOKUP(A19,Data!C$21:C$838,Data!G$21:G$838)","v":6599439},27,1200,280]
[295,19,6954276,{"$f":"LOOKUP(A20,Data!C$21:C$838,Data!G$21:G$838)","v":6954282},-6,1200,295]
[312,20,7356394,{"$f":"LOOKUP(A21,Data!C$21:C$838,Data!G$21:G$838)","v":7356384},10,1200,312]
[329,21,7758512,{"$f":"LOOKUP(A22,Data!C$21:C$838,Data!G$21:G$838)","v":7758486},26,1200,329]
[344,22,8113322,{"$f":"LOOKUP(A23,Data!C$21:C$838,Data!G$21:G$838)","v":8113329},-7,1200,344]
[{"$f":"A23+IF(MOD(B23,3)=0,15,17)","v":361},{"$f":"MOD(B23,Yerms)+1","v":23},{"$f":"(A24-1)*PPM","v":8515440},{"$f":"LOOKUP(A24,Data!C$21:C$838,Data!G$21:G$838)","v":8515431},9,{"$f":"F23","v":1200},{"$f":"A24-StartMonth+1","v":361}]
[378,24,8917558,{"$f":"LOOKUP(A25,Data!C$21:C$838,Data!G$21:G$838)","v":8917533},25,1200,378]
[393,25,9272368,{"$f":"LOOKUP(A26,Data!C$21:C$838,Data!G$21:G$838)","v":9272376},-8,1200,393]
[410,26,9674486,{"$f":"LOOKUP(A27,Data!C$21:C$838,Data!G$21:G$838)","v":9674478},8,1200,410]
[427,27,10076604,{"$f":"LOOKUP(A28,Data!C$21:C$838,Data!G$21:G$838)","v":10076580},24,1200,427]
[442,28,10431414,{"$f":"LOOKUP(A29,Data!C$21:C$838,Data!G$21:G$838)","v":10431423},-9,1200,442]
[459,29,10833532,{"$f":"LOOKUP(A30,Data!C$21:C$838,Data!G$21:G$838)","v":10833525},7,1200,459]
[476,30,11235650,{"$f":"LOOKUP(A31,Data!C$21:C$838,Data!G$21:G$838)","v":11235627},23,1200,476]
[491,31,11590460,{"$f":"LOOKUP(A32,Data!C$21:C$838,Data!G$21:G$838)","v":11590470},-10,1200,491]
[508,32,11992578,{"$f":"LOOKUP(A33,Data!C$21:C$838,Data!G$21:G$838)","v":11992572},6,1200,508]
[525,33,12394696,{"$f":"LOOKUP(A34,Data!C$21:C$838,Data!G$21:G$838)","v":12394674},{"$f":"IF(AND(StartMonth>15,MOD(B34,3)=0),NA(),C34-D34)","v":22},1200,525]
[540,34,12749506,{"$f":"LOOKUP(A35,Data!C$21:C$838,Data!G$21:G$838)","v":12749517},-11,1200,540]
[557,35,13151624,{"$f":"LOOKUP(A36,Data!C$21:C$838,Data!G$21:G$838)","v":13151619},5,1200,557]
[574,36,13553742,{"$f":"LOOKUP(A37,Data!C$21:C$838,Data!G$21:G$838)","v":13553721},21,1200,574]
[589,37,13908552,{"$f":"LOOKUP(A38,Data!C$21:C$838,Data!G$21:G$838)","v":13908564},-12,1200,589]
[606,38,14310670,{"$f":"LOOKUP(A39,Data!C$21:C$838,Data!G$21:G$838)","v":14310666},4,1200,606]
[623,39,14712788,{"$f":"LOOKUP(A40,Data!C$21:C$838,Data!G$21:G$838)","v":14712768},20,1200,623]
[638,40,15067598,{"$f":"LOOKUP(A41,Data!C$21:C$838,Data!G$21:G$838)","v":15067611},-13,1200,638]
[655,41,15469716,{"$f":"LOOKUP(A42,Data!C$21:C$838,Data!G$21:G$838)","v":15469713},3,1200,655]
[672,42,15871834,{"$f":"LOOKUP(A43,Data!C$21:C$838,Data!G$21:G$838)","v":15871815},19,1200,672]
[687,43,16226644,{"$f":"LOOKUP(A44,Data!C$21:C$838,Data!G$21:G$838)","v":16226658},-14,1200,687]
[704,44,16628762,{"$f":"LOOKUP(A45,Data!C$21:C$838,Data!G$21:G$838)","v":16628760},2,1200,704]
[721,45,17030880,{"$f":"LOOKUP(A46,Data!C$21:C$838,Data!G$21:G$838)","v":17030862},18,1200,721]
[{"$f":"A46+IF(MOD(B46,3)=0,15,17)","v":736},{"$f":"MOD(B46,Yerms)+1","v":46},{"$f":"(A47-1)*PPM","v":17385690},{"$f":"LOOKUP(A47,Data!C$21:C$838,Data!G$21:G$838)","v":17385705},-15,{"$f":"F46","v":1200},{"$f":"A47-StartMonth+1","v":736}]
[753,47,17787808,{"$f":"LOOKUP(A48,Data!C$21:C$838,Data!G$21:G$838)","v":17787807},1,1200,753]
[770,48,18189926,{"$f":"LOOKUP(A49,Data!C$21:C$838,Data!G$21:G$838)","v":18189909},17,1200,770]
[785,49,18544736,{"$f":"LOOKUP(A50,Data!C$21:C$838,Data!G$21:G$838)","v":18544752},-16,1200,785]
[802,1,18946854,{"$f":"LOOKUP(A51,Data!C$21:C$838,Data!G$21:G$838)","v":18946854},0,1200,802]

{"sheet":"Rules","index":3,"n_rows":11,"n_cols":3,"rows_kept":11}
["odd-numbered months have 30 days, even numbered months have 29 days"]
["yerms have 17 months (9 full, 8 deficient) or 15 months (8 full, 7 deficient)"]
["length of 17-month yerm =",{"$f":"(9*30)+(8*29)","v":502},"days"]
["length of 15-month yerm =",{"$f":"(8*30)+(7*29)","v":443},"days"]
["yerms are numbered from yerm #1"]
["if yerm# is divisible by 3 then it has 15 months, otherwise it has 17 months"]
["repeating pattern = 17+17+15 = ",{"$f":"17+17+15","v":49},"months"]
["which is repeated",{"$f":"INT(MPC/B7)","v":16},"times"]
["to make a subtotal of",{"$f":"3*B8","v":48},"yerms"]
["full cycle has",{"$f":"Yerms","v":49},"yerms"]
[{"$f":"\"The last yerm #\"&Yerms&\" has 17 months.\"","v":"The last yerm #49 has 17 months."}]

{"sheet":"Zoom","index":4,"n_rows":7,"n_cols":6,"rows_kept":7}
[0,"= Current Zoom Level"]
["Level","Months","MajorTick","MinorTick","Shift","Connect"]
[{"$f":"ROW()-3","v":0},{"$f":"MPC","v":801},49,7,null,false]
[1,392,49,7,{"$f":"B5","v":196},false]
[2,196,7,7,{"$f":"B6","v":98},false]
[3,98,7,1,49,true]
[4,49,2,1,49,true]

{"sheet":"Labels","index":5,"n_rows":24,"n_cols":3,"rows_kept":24}
["Month","Hours",{"$f":"\"Span \"&B2-B24&\"h\"","v":"Span 66h"}]
[802,33]
[{"$f":"A2","v":802},{"$f":"B2-3","v":30}]
[{"$f":"A3","v":802},{"$f":"B3-3","v":27}]
[{"$f":"A4","v":802},24]
[{"$f":"A5","v":802},21]
[802,18]
[802,15]
[802,12]
[802,9]
[802,6]
[802,3]
[802,0]
[802,-3]
[802,-6]
[802,-9]
[802,-12]
[802,-15]
[802,-18]
[802,-21]
[802,-24]
[802,-27]
[802,-30]
[802,-33]