{"text_format":"3","workbook":"xlsx","n_sheets":6,"sheets":["Chart","Data","Years","Years2","Zoom","Labels"],"not_rendered":{"charts":1,"macros":1,"external_links":1,"defined_names":19},"read":"whole","date_system":"1900"}

{"sheet":"Chart","index":0,"n_rows":48,"n_cols":17,"rows_kept":48}
["Javanese Lunar Calendar (Windu) Jitter Relative to Mean Month"]
[]
[{"$f":"\"Each lunar year (tahun) has 12 months.  Lunar cycle contains \"&MPC&\" months (\"&FMPC&\" full, \"&DMPC&\" deficient)\"","v":"Each lunar year (tahun) has 12 months.  Lunar cycle contains 1440 months (764 full, 676 deficient)"}]
[{"$f":"\"= \"&DPC&\" days = \"&reducefraction(DPC,7,FALSE,FALSE,TRUE)&\" weeks = \"&MPC/12&\" tahun = \"&MPC/96&\" windu.\"&IF(Reverse,\"  After a common year odd-numbered\",)","v":"= 42524 days = 6074+6/7 weeks = 120 tahun = 15 windu."}]
[{"$f":"IF(Reverse,,\"Odd-numbered \")&\"months have 30 days, even-numbered months have 29 days.\"&IF(Reverse,\"  After a leap year odd-numbered months have 29 days, even-numbered\",)","v":"Odd-numbered months have 30 days, even-numbered months have 29 days."}]
[{"$f":"IF(Reverse,\"months have 30 days.  \",)&\"Year y is a leap year if and only if (3y + \"&Offset&\") MOD 8 < 3, in which case the 12th month has 30 days.\"","v":"Year y is a leap year if and only if (3y + 0) MOD 8 < 3, in which case the 12th month has 30 days."}]
[{"$f":"\"Leap years in each cycle are: \"&javanese_leap_years(Offset)&\".  Common years = FDFDFDFDFDFD\"&IF(Reverse,\" or DFDFDFDFDFDF\",)&\" = 354 days.\"","v":"Leap years in each cycle are: 3, 6, 8.  Common years = FDFDFDFDFDFD = 354 days."}]
[{"$f":"\"Leap years = FDFDFDFDFDFF = 355 days.\"","v":"Leap years = FDFDFDFDFDFF = 355 days."},{"$nulls":5},"In this variant the 120th year of cycle is a common year."]
[{"$f":"\"Mean month = \"&\"29+\"&reducefraction(FMPC,MPC,FALSE,FALSE,TRUE)&\" days = 29d 12h 44m \"&reducefraction(240*(360*FMPC-191*MPC),MPC,FALSE,FALSE,TRUE)&\" seconds, or about 29\"&MID(FMPC/MPC,2,20)&\" days or 29d 12h 44m \"&ROUND(240*(360*FMPC-191*MPC)/MPC,6)&\" seconds.\"","v":"Mean month = 29+191/360 days = 29d 12h 44m 0 seconds, or about 29.530555555555556 days or 29d 12h 44m 0 seconds."}]
[{"$f":"\"Duration per ''Part'' = 1/\"&MPC&\" day = \"&reducefraction(24,MPC,FALSE,FALSE,TRUE)&\" hour = \"&reducefraction(1440,MPC,FALSE,FALSE,TRUE)&\" minutes = \"&reducefraction(86400,MPC,FALSE,FALSE,TRUE)&\" seconds.  One hour = \"&reducefraction(MPC,24,FALSE,FALSE,TRUE)&\" parts.\"","v":"Duration per ''Part'' = 1/1440 day = 1/60 hour = 1 minutes = 60 seconds.  One hour = 60 parts."}]
[]
[{"$nulls":16},false]
{"$rows_empty":8}
[{"$nulls":16},9]
[{"$nulls":16},"Selected"]
[{"$nulls":16},"Month"]
[{"$nulls":16},"in Year"]
[{"$nulls":16},"(1 to 12)"]
[]
[]
[]
[]
[]
[]
[{"$nulls":16},6]
[{"$nulls":16},"Selected"]
[{"$nulls":16},"Month 2"]
[{"$nulls":16},"in Year"]
[{"$nulls":16},"(1 to 12)"]
{"$rows_empty":7}
[{"$nulls":16},0]
[{"$nulls":16},"Leap"]
[{"$nulls":16},"Rule"]
[{"$nulls":16},"Offset"]
[{"$nulls":16},"(0 to 7)"]

{"sheet":"Data","index":1,"n_rows":2914,"n_cols":9,"rows_kept":2914}
["Lunar Cycle Jitter Evaluator"]
["by Dr. Irv Bromberg, University of Toronto, Canada"]
["http://individual.utoronto.ca/intervalmath/jitter/index.html",null,null,"Jitter","(parts)"]
[{"$nulls":3},{"$f":"MAX(H:H)","v":1640},"maximum",{"$f":"reducefraction(JitterMax*MPC,MPC,FALSE,FALSE,FALSE)","v":"1640"}]
["Months per Cycle (Parts per Day):",{"$f":"12*8*15","v":1440},"months (parts)",{"$f":"MIN(H:H)","v":-2020},"minimum",{"$f":"reducefraction(JitterMin*MPC,MPC,FALSE,FALSE,FALSE)","v":"–(2020)"}]
["30-day Months per Cycle:",{"$f":"(6*8+3)*15-1","v":764},"months",{"$f":"D4-D5","v":3660},"range",{"$f":"reducefraction(JitterRange*MPC,MPC,FALSE,FALSE,FALSE)","v":"3660"}]
["29-day Months per Cycle:",{"$f":"MPC-FMPC","v":676},"months",{"$f":"\"Jitter range = \"&F6&\" parts = \"&reducefraction(F6*24,MPC,FALSE,FALSE,FALSE)&\" hours\"","v":"Jitter range = 3660 parts = 61 hours"}]
["Days per Cycle (Parts per Month):",{"$f":"29*MPC+FMPC","v":42524},"days (parts)"]
["Yerms per Cycle:",{"$f":"2*DPC-59*MPC","v":88},"yerms","Limits for Chart:"]
["Mean Month:",{"$f":"\"29 + \"&reducefraction(FMPC,MPC,FALSE,FALSE,FALSE)","v":"29 + 191 / 360"},"days","x","y","Hours"]
["Mean Month >29d:",{"$f":"FMPC/MPC","v":{"v":0.5305555555555556,"d":"0.530555555555556"}},"days",{"$f":"B23","v":1},{"$f":"JitterMax","v":1640},{"$f":"E11*24/MPC","v":27.333333333333332}]
["Mean Month >29d 12h 44m:",{"$f":"reducefraction(240*(360*FMPC-191*MPC),MPC,FALSE,FALSE,TRUE)","v":"0"},"seconds",{"$f":"2*MPC+1","v":2881},{"$f":"E11","v":1640},{"$f":"E12*24/MPC","v":27.333333333333332}]
["… or approximately:",{"$f":"240*(360*FMPC-191*MPC)/MPC","v":0},"seconds"]
[{"$nulls":3},{"$f":"D11","v":1},0]
[{"$nulls":3},{"$f":"D12","v":2881},0]
[]
[{"$nulls":3},{"$f":"B23","v":1},{"$f":"JitterMin","v":-2020},{"$f":"E17*24/MPC","v":-33.666666666666664}]
["Duration per Part:",{"$f":"reducefraction(1440,MPC,FALSE,FALSE,FALSE)","v":"1"},"minutes",{"$f":"D12","v":2881},{"$f":"E17","v":-2020},{"$f":"E18*24/MPC","v":-33.666666666666664}]
["Offset:",{"$f":"Offset","v":0}]
["Leap Years:",{"$f":"javanese_leap_years(Offset)","v":"3, 6, 8"},"except last year of 15x8=120 year cycle",{"$nulls":5},"Reverse"]
[{"$nulls":8},false]
["Year","Month #","Month in Year","Leap Month?","Month Length","New Month Moment","Elapsed","Difference","Prior Leap"]
[1,1,1,{"$f":"AND(C23=12,AND(MOD(A23,120)<>0,MOD(A23*3+Offset,8)<3))","v":false},{"$f":"IF(MOD(C23,2)=1,IF(I23,29,30),IF(I23,30,29))+IF(D23,1,0)","v":30},0,0,{"$f":"F23-G23","v":0},{"$f":"IF(Reverse,AND(MOD(A23-1,120)<>0,MOD((A23-1)*3+Offset,8)<3),FALSE)","v":false}]
[{"$f":"IF(C24=1,A23+1,A23)","v":1},{"$f":"B23+1","v":2},{"$f":"IF(C23=12,1,C23+1)","v":2},{"$f":"AND(C24=12,AND(MOD(A24,120)<>0,MOD(A24*3+Offset,8)<3))","v":false},{"$f":"IF(MOD(C24,2)=1,IF(I24,29,30),IF(I24,30,29))+IF(D24,1,0)","v":29},{"$f":"F23+PPM","v":42524},{"$f":"G23+E23*PPD","v":43200},{"$f":"F24-G24","v":-676},{"$f":"IF(Reverse,AND(MOD(A24-1,120)<>0,MOD((A24-1)*3+Offset,8)<3),FALSE)","v":false}]
[{"$f":"IF(C25=1,A24+1,A24)","v":1},{"$f":"B24+1","v":3},{"$f":"IF(C24=12,1,C24+1)","v":3},{"$f":"AND(C25=12,AND(MOD(A25,120)<>0,MOD(A25*3+Offset,8)<3))","v":false},{"$f":"IF(MOD(C25,2)=1,IF(I25,29,30),IF(I25,30,29))+IF(D25,1,0)","v":30},85048,84960,{"$f":"F25-G25","v":88},{"$f":"IF(Reverse,AND(MOD(A25-1,120)<>0,MOD((A25-1)*3+Offset,8)<3),FALSE)","v":false}]
[1,4,4,false,29,127572,128160,-588,false]
[1,5,5,false,30,170096,169920,176,false]
[1,6,6,false,29,212620,213120,-500,false]
[1,7,7,false,30,255144,254880,264,false]
[1,8,8,false,29,297668,298080,-412,false]
[1,9,9,false,30,340192,339840,352,false]
[1,10,10,false,29,382716,383040,-324,false]
[1,11,11,false,30,425240,424800,440,false]
[1,12,12,false,29,467764,468000,-236,false]
[2,13,1,false,30,510288,509760,528,false]
[2,14,2,false,29,552812,552960,-148,false]
[2,15,3,false,30,595336,594720,616,false]
[2,16,4,false,29,637860,637920,-60,false]
[2,17,5,false,30,680384,679680,704,false]
[2,18,6,false,29,722908,722880,28,false]
[2,19,7,false,30,765432,764640,792,false]
[2,20,8,false,29,807956,807840,116,false]
[2,21,9,false,30,850480,849600,880,false]
[2,22,10,false,29,893004,892800,204,false]
[2,23,11,false,30,935528,934560,968,false]
[2,24,12,false,29,978052,977760,292,false]
[3,25,1,false,30,1020576,1019520,1056,false]
[3,26,2,false,29,1063100,1062720,380,false]
[3,27,3,false,30,1105624,1104480,1144,false]
[3,28,4,false,29,1148148,1147680,468,false]
[3,29,5,false,30,1190672,1189440,1232,false]
[3,30,6,false,29,1233196,1232640,556,false]
[3,31,7,false,30,1275720,1274400,1320,false]
[3,32,8,false,29,1318244,1317600,644,false]
[3,33,9,false,30,1360768,1359360,1408,false]
[3,34,10,false,29,1403292,1402560,732,false]
[3,35,11,false,30,1445816,1444320,1496,false]
[3,36,12,true,30,1488340,1487520,820,false]
[4,37,1,false,30,1530864,1530720,144,false]
[4,38,2,false,29,1573388,1573920,-532,false]
{"$rows_left_out":2855}
{"sheet":"Years","index":2,"n_rows":242,"n_cols":8,"rows_kept":242}
["Month in Cycle","Year","New Year Moment","Elapsed","Difference","Top","Year Start","Year"]
[{"$f":"StartMonth","v":9},1,{"$f":"(A2-1)*PPM","v":340192},{"$f":"LOOKUP(A2,Data!B$23:B$2914,Data!G$23:G$2914)","v":339840},{"$f":"C2-D2","v":352},2000,{"$f":"A2-StartMonth+1","v":1},1]
[{"$f":"A2+12","v":21},{"$f":"MOD(B2,8)+1","v":2},{"$f":"(A3-1)*PPM","v":850480},{"$f":"LOOKUP(A3,Data!B$23:B$2914,Data!G$23:G$2914)","v":849600},{"$f":"C3-D3","v":880},{"$f":"F2","v":2000},{"$f":"A3-StartMonth+1","v":13},{"$f":"H2+1","v":2}]
[{"$f":"A3+12","v":33},{"$f":"MOD(B3,8)+1","v":3},{"$f":"(A4-1)*PPM","v":1360768},{"$f":"LOOKUP(A4,Data!B$23:B$2914,Data!G$23:G$2914)","v":1359360},{"$f":"C4-D4","v":1408},{"$f":"F3","v":2000},{"$f":"A4-StartMonth+1","v":25},{"$f":"H3+1","v":3}]
[45,4,1871056,{"$f":"LOOKUP(A5,Data!B$23:B$2914,Data!G$23:G$2914)","v":1870560},496,2000,37,4]
[57,5,2381344,{"$f":"LOOKUP(A6,Data!B$23:B$2914,Data!G$23:G$2914)","v":2380320},1024,2000,49,5]
[69,6,2891632,{"$f":"LOOKUP(A7,Data!B$23:B$2914,Data!G$23:G$2914)","v":2890080},1552,2000,61,6]
[81,7,3401920,{"$f":"LOOKUP(A8,Data!B$23:B$2914,Data!G$23:G$2914)","v":3401280},640,2000,73,7]
[93,8,3912208,{"$f":"LOOKUP(A9,Data!B$23:B$2914,Data!G$23:G$2914)","v":3911040},1168,2000,85,8]
[105,1,4422496,{"$f":"LOOKUP(A10,Data!B$23:B$2914,Data!G$23:G$2914)","v":4422240},256,2000,97,9]
[117,2,4932784,{"$f":"LOOKUP(A11,Data!B$23:B$2914,Data!G$23:G$2914)","v":4932000},784,2000,109,10]
[129,3,5443072,{"$f":"LOOKUP(A12,Data!B$23:B$2914,Data!G$23:G$2914)","v":5441760},1312,2000,121,11]
[141,4,5953360,{"$f":"LOOKUP(A13,Data!B$23:B$2914,Data!G$23:G$2914)","v":5952960},400,2000,133,12]
[153,5,6463648,{"$f":"LOOKUP(A14,Data!B$23:B$2914,Data!G$23:G$2914)","v":6462720},928,2000,145,13]
[165,6,6973936,{"$f":"LOOKUP(A15,Data!B$23:B$2914,Data!G$23:G$2914)","v":6972480},1456,2000,157,14]
[177,7,7484224,{"$f":"LOOKUP(A16,Data!B$23:B$2914,Data!G$23:G$2914)","v":7483680},544,2000,169,15]
[189,8,7994512,{"$f":"LOOKUP(A17,Data!B$23:B$2914,Data!G$23:G$2914)","v":7993440},1072,2000,181,16]
[201,1,8504800,{"$f":"LOOKUP(A18,Data!B$23:B$2914,Data!G$23:G$2914)","v":8504640},160,2000,193,17]
[213,2,9015088,{"$f":"LOOKUP(A19,Data!B$23:B$2914,Data!G$23:G$2914)","v":9014400},688,2000,205,18]
[225,3,9525376,{"$f":"LOOKUP(A20,Data!B$23:B$2914,Data!G$23:G$2914)","v":9524160},1216,2000,217,19]
[237,4,10035664,{"$f":"LOOKUP(A21,Data!B$23:B$2914,Data!G$23:G$2914)","v":10035360},304,2000,229,20]
[249,5,10545952,{"$f":"LOOKUP(A22,Data!B$23:B$2914,Data!G$23:G$2914)","v":10545120},832,2000,241,21]
[261,6,11056240,{"$f":"LOOKUP(A23,Data!B$23:B$2914,Data!G$23:G$2914)","v":11054880},1360,2000,253,22]
[273,7,11566528,{"$f":"LOOKUP(A24,Data!B$23:B$2914,Data!G$23:G$2914)","v":11566080},448,2000,265,23]
[285,8,12076816,{"$f":"LOOKUP(A25,Data!B$23:B$2914,Data!G$23:G$2914)","v":12075840},976,2000,277,24]
[297,1,12587104,{"$f":"LOOKUP(A26,Data!B$23:B$2914,Data!G$23:G$2914)","v":12587040},64,2000,289,25]
[309,2,13097392,{"$f":"LOOKUP(A27,Data!B$23:B$2914,Data!G$23:G$2914)","v":13096800},592,2000,301,26]
[321,3,13607680,{"$f":"LOOKUP(A28,Data!B$23:B$2914,Data!G$23:G$2914)","v":13606560},1120,2000,313,27]
[333,4,14117968,{"$f":"LOOKUP(A29,Data!B$23:B$2914,Data!G$23:G$2914)","v":14117760},208,2000,325,28]
[345,5,14628256,{"$f":"LOOKUP(A30,Data!B$23:B$2914,Data!G$23:G$2914)","v":14627520},736,2000,337,29]
[357,6,15138544,{"$f":"LOOKUP(A31,Data!B$23:B$2914,Data!G$23:G$2914)","v":15137280},1264,2000,349,30]
[369,7,15648832,{"$f":"LOOKUP(A32,Data!B$23:B$2914,Data!G$23:G$2914)","v":15648480},352,2000,361,31]
[381,8,16159120,{"$f":"LOOKUP(A33,Data!B$23:B$2914,Data!G$23:G$2914)","v":16158240},880,2000,373,32]
[393,1,16669408,{"$f":"LOOKUP(A34,Data!B$23:B$2914,Data!G$23:G$2914)","v":16669440},-32,2000,385,33]
[405,2,17179696,{"$f":"LOOKUP(A35,Data!B$23:B$2914,Data!G$23:G$2914)","v":17179200},496,2000,397,34]
[417,3,17689984,{"$f":"LOOKUP(A36,Data!B$23:B$2914,Data!G$23:G$2914)","v":17688960},1024,2000,409,35]
[429,4,18200272,{"$f":"LOOKUP(A37,Data!B$23:B$2914,Data!G$23:G$2914)","v":18200160},112,2000,421,36]
[441,5,18710560,{"$f":"LOOKUP(A38,Data!B$23:B$2914,Data!G$23:G$2914)","v":18709920},640,2000,433,37]
[453,6,19220848,{"$f":"LOOKUP(A39,Data!B$23:B$2914,Data!G$23:G$2914)","v":19219680},1168,2000,445,38]
[465,7,19731136,{"$f":"LOOKUP(A40,Data!B$23:B$2914,Data!G$23:G$2914)","v":19730880},256,2000,457,39]
[477,8,20241424,{"$f":"LOOKUP(A41,Data!B$23:B$2914,Data!G$23:G$2914)","v":20240640},784,2000,469,40]
[489,1,20751712,{"$f":"LOOKUP(A42,Data!B$23:B$2914,Data!G$23:G$2914)","v":20751840},-128,2000,481,41]
[501,2,21262000,{"$f":"LOOKUP(A43,Data!B$23:B$2914,Data!G$23:G$2914)","v":21261600},400,2000,493,42]
[513,3,21772288,{"$f":"LOOKUP(A44,Data!B$23:B$2914,Data!G$23:G$2914)","v":21771360},928,2000,505,43]
[525,4,22282576,{"$f":"LOOKUP(A45,Data!B$23:B$2914,Data!G$23:G$2914)","v":22282560},16,2000,517,44]
[537,5,22792864,{"$f":"LOOKUP(A46,Data!B$23:B$2914,Data!G$23:G$2914)","v":22792320},544,2000,529,45]
[549,6,23303152,{"$f":"LOOKUP(A47,Data!B$23:B$2914,Data!G$23:G$2914)","v":23302080},1072,2000,541,46]
[561,7,23813440,{"$f":"LOOKUP(A48,Data!B$23:B$2914,Data!G$23:G$2914)","v":23813280},160,2000,553,47]
[573,8,24323728,{"$f":"LOOKUP(A49,Data!B$23:B$2914,Data!G$23:G$2914)","v":24323040},688,2000,565,48]
[585,1,24834016,{"$f":"LOOKUP(A50,Data!B$23:B$2914,Data!G$23:G$2914)","v":24834240},-224,2000,577,49]
[597,2,25344304,{"$f":"LOOKUP(A51,Data!B$23:B$2914,Data!G$23:G$2914)","v":25344000},304,2000,589,50]
[609,3,25854592,{"$f":"LOOKUP(A52,Data!B$23:B$2914,Data!G$23:G$2914)","v":25853760},832,2000,601,51]
[621,4,26364880,{"$f":"LOOKUP(A53,Data!B$23:B$2914,Data!G$23:G$2914)","v":26364960},-80,2000,613,52]
[633,5,26875168,{"$f":"LOOKUP(A54,Data!B$23:B$2914,Data!G$23:G$2914)","v":26874720},448,2000,625,53]
[645,6,27385456,{"$f":"LOOKUP(A55,Data!B$23:B$2914,Data!G$23:G$2914)","v":27384480},976,2000,637,54]
[657,7,27895744,{"$f":"LOOKUP(A56,Data!B$23:B$2914,Data!G$23:G$2914)","v":27895680},64,2000,649,55]
[669,8,28406032,{"$f":"LOOKUP(A57,Data!B$23:B$2914,Data!G$23:G$2914)","v":28405440},592,2000,661,56]
[681,1,28916320,{"$f":"LOOKUP(A58,Data!B$23:B$2914,Data!G$23:G$2914)","v":28916640},-320,2000,673,57]
[693,2,29426608,{"$f":"LOOKUP(A59,Data!B$23:B$2914,Data!G$23:G$2914)","v":29426400},208,2000,685,58]
[705,3,29936896,{"$f":"LOOKUP(A60,Data!B$23:B$2914,Data!G$23:G$2914)","v":29936160},736,2000,697,59]
{"$rows_left_out":183}
{"sheet":"Years2","index":3,"n_rows":242,"n_cols":8,"rows_kept":242}
["Month in Cycle","Year","New Year Moment","Elapsed","Difference","Top","Year Start","Year"]
[{"$f":"StartMonth2","v":6},1,{"$f":"(A2-1)*PPM","v":212620},{"$f":"LOOKUP(A2,Data!B$23:B$2914,Data!G$23:G$2914)","v":213120},{"$f":"C2-D2","v":-500},2000,{"$f":"A2-StartMonth+1","v":-2},1]
[{"$f":"A2+12","v":18},{"$f":"MOD(B2,8)+1","v":2},722908,{"$f":"LOOKUP(A3,Data!B$23:B$2914,Data!G$23:G$2914)","v":722880},28,{"$f":"F2","v":2000},10,{"$f":"H2+1","v":2}]
[30,3,1233196,{"$f":"LOOKUP(A4,Data!B$23:B$2914,Data!G$23:G$2914)","v":1232640},556,2000,22,3]
[42,4,1743484,{"$f":"LOOKUP(A5,Data!B$23:B$2914,Data!G$23:G$2914)","v":1743840},-356,2000,34,4]
[54,5,2253772,{"$f":"LOOKUP(A6,Data!B$23:B$2914,Data!G$23:G$2914)","v":2253600},172,2000,46,5]
[66,6,2764060,{"$f":"LOOKUP(A7,Data!B$23:B$2914,Data!G$23:G$2914)","v":2763360},700,2000,58,6]
[78,7,3274348,{"$f":"LOOKUP(A8,Data!B$23:B$2914,Data!G$23:G$2914)","v":3274560},-212,2000,70,7]
[90,8,3784636,{"$f":"LOOKUP(A9,Data!B$23:B$2914,Data!G$23:G$2914)","v":3784320},316,2000,82,8]
[102,1,4294924,{"$f":"LOOKUP(A10,Data!B$23:B$2914,Data!G$23:G$2914)","v":4295520},-596,2000,94,9]
[114,2,4805212,{"$f":"LOOKUP(A11,Data!B$23:B$2914,Data!G$23:G$2914)","v":4805280},-68,2000,106,10]
[126,3,5315500,{"$f":"LOOKUP(A12,Data!B$23:B$2914,Data!G$23:G$2914)","v":5315040},460,2000,118,11]
[138,4,5825788,{"$f":"LOOKUP(A13,Data!B$23:B$2914,Data!G$23:G$2914)","v":5826240},-452,2000,130,12]
[150,5,6336076,{"$f":"LOOKUP(A14,Data!B$23:B$2914,Data!G$23:G$2914)","v":6336000},76,2000,142,13]
[162,6,6846364,{"$f":"LOOKUP(A15,Data!B$23:B$2914,Data!G$23:G$2914)","v":6845760},604,2000,154,14]
[174,7,7356652,{"$f":"LOOKUP(A16,Data!B$23:B$2914,Data!G$23:G$2914)","v":7356960},-308,2000,166,15]
[186,8,7866940,{"$f":"LOOKUP(A17,Data!B$23:B$2914,Data!G$23:G$2914)","v":7866720},220,2000,178,16]
[198,1,8377228,{"$f":"LOOKUP(A18,Data!B$23:B$2914,Data!G$23:G$2914)","v":8377920},-692,2000,190,17]
[210,2,8887516,{"$f":"LOOKUP(A19,Data!B$23:B$2914,Data!G$23:G$2914)","v":8887680},-164,2000,202,18]
[222,3,9397804,{"$f":"LOOKUP(A20,Data!B$23:B$2914,Data!G$23:G$2914)","v":9397440},364,2000,214,19]
[234,4,9908092,{"$f":"LOOKUP(A21,Data!B$23:B$2914,Data!G$23:G$2914)","v":9908640},-548,2000,226,20]
[246,5,10418380,{"$f":"LOOKUP(A22,Data!B$23:B$2914,Data!G$23:G$2914)","v":10418400},-20,2000,238,21]
[258,6,10928668,{"$f":"LOOKUP(A23,Data!B$23:B$2914,Data!G$23:G$2914)","v":10928160},508,2000,250,22]
[270,7,11438956,{"$f":"LOOKUP(A24,Data!B$23:B$2914,Data!G$23:G$2914)","v":11439360},-404,2000,262,23]
[282,8,11949244,{"$f":"LOOKUP(A25,Data!B$23:B$2914,Data!G$23:G$2914)","v":11949120},124,2000,274,24]
[294,1,12459532,{"$f":"LOOKUP(A26,Data!B$23:B$2914,Data!G$23:G$2914)","v":12460320},-788,2000,286,25]
[306,2,12969820,{"$f":"LOOKUP(A27,Data!B$23:B$2914,Data!G$23:G$2914)","v":12970080},-260,2000,298,26]
[318,3,13480108,{"$f":"LOOKUP(A28,Data!B$23:B$2914,Data!G$23:G$2914)","v":13479840},268,2000,310,27]
[330,4,13990396,{"$f":"LOOKUP(A29,Data!B$23:B$2914,Data!G$23:G$2914)","v":13991040},-644,2000,322,28]
[342,5,14500684,{"$f":"LOOKUP(A30,Data!B$23:B$2914,Data!G$23:G$2914)","v":14500800},-116,2000,334,29]
[354,6,15010972,{"$f":"LOOKUP(A31,Data!B$23:B$2914,Data!G$23:G$2914)","v":15010560},412,2000,346,30]
[366,7,15521260,{"$f":"LOOKUP(A32,Data!B$23:B$2914,Data!G$23:G$2914)","v":15521760},-500,2000,358,31]
[378,8,16031548,{"$f":"LOOKUP(A33,Data!B$23:B$2914,Data!G$23:G$2914)","v":16031520},28,2000,370,32]
[390,1,16541836,{"$f":"LOOKUP(A34,Data!B$23:B$2914,Data!G$23:G$2914)","v":16542720},-884,2000,382,33]
[402,2,17052124,{"$f":"LOOKUP(A35,Data!B$23:B$2914,Data!G$23:G$2914)","v":17052480},-356,2000,394,34]
[414,3,17562412,{"$f":"LOOKUP(A36,Data!B$23:B$2914,Data!G$23:G$2914)","v":17562240},172,2000,406,35]
[426,4,18072700,{"$f":"LOOKUP(A37,Data!B$23:B$2914,Data!G$23:G$2914)","v":18073440},-740,2000,418,36]
[438,5,18582988,{"$f":"LOOKUP(A38,Data!B$23:B$2914,Data!G$23:G$2914)","v":18583200},-212,2000,430,37]
[450,6,19093276,{"$f":"LOOKUP(A39,Data!B$23:B$2914,Data!G$23:G$2914)","v":19092960},316,2000,442,38]
[462,7,19603564,{"$f":"LOOKUP(A40,Data!B$23:B$2914,Data!G$23:G$2914)","v":19604160},-596,2000,454,39]
[474,8,20113852,{"$f":"LOOKUP(A41,Data!B$23:B$2914,Data!G$23:G$2914)","v":20113920},-68,2000,466,40]
[486,1,20624140,{"$f":"LOOKUP(A42,Data!B$23:B$2914,Data!G$23:G$2914)","v":20625120},-980,2000,478,41]
[498,2,21134428,{"$f":"LOOKUP(A43,Data!B$23:B$2914,Data!G$23:G$2914)","v":21134880},-452,2000,490,42]
[510,3,21644716,{"$f":"LOOKUP(A44,Data!B$23:B$2914,Data!G$23:G$2914)","v":21644640},76,2000,502,43]
[522,4,22155004,{"$f":"LOOKUP(A45,Data!B$23:B$2914,Data!G$23:G$2914)","v":22155840},-836,2000,514,44]
[534,5,22665292,{"$f":"LOOKUP(A46,Data!B$23:B$2914,Data!G$23:G$2914)","v":22665600},-308,2000,526,45]
[546,6,23175580,{"$f":"LOOKUP(A47,Data!B$23:B$2914,Data!G$23:G$2914)","v":23175360},220,2000,538,46]
[558,7,23685868,{"$f":"LOOKUP(A48,Data!B$23:B$2914,Data!G$23:G$2914)","v":23686560},-692,2000,550,47]
[570,8,24196156,{"$f":"LOOKUP(A49,Data!B$23:B$2914,Data!G$23:G$2914)","v":24196320},-164,2000,562,48]
[582,1,24706444,{"$f":"LOOKUP(A50,Data!B$23:B$2914,Data!G$23:G$2914)","v":24707520},-1076,2000,574,49]
[594,2,25216732,{"$f":"LOOKUP(A51,Data!B$23:B$2914,Data!G$23:G$2914)","v":25217280},-548,2000,586,50]
[606,3,25727020,{"$f":"LOOKUP(A52,Data!B$23:B$2914,Data!G$23:G$2914)","v":25727040},-20,2000,598,51]
[618,4,26237308,{"$f":"LOOKUP(A53,Data!B$23:B$2914,Data!G$23:G$2914)","v":26238240},-932,2000,610,52]
[630,5,26747596,{"$f":"LOOKUP(A54,Data!B$23:B$2914,Data!G$23:G$2914)","v":26748000},-404,2000,622,53]
[642,6,27257884,{"$f":"LOOKUP(A55,Data!B$23:B$2914,Data!G$23:G$2914)","v":27257760},124,2000,634,54]
[654,7,27768172,{"$f":"LOOKUP(A56,Data!B$23:B$2914,Data!G$23:G$2914)","v":27768960},-788,2000,646,55]
[666,8,28278460,{"$f":"LOOKUP(A57,Data!B$23:B$2914,Data!G$23:G$2914)","v":28278720},-260,2000,658,56]
[678,1,28788748,{"$f":"LOOKUP(A58,Data!B$23:B$2914,Data!G$23:G$2914)","v":28789920},-1172,2000,670,57]
[690,2,29299036,{"$f":"LOOKUP(A59,Data!B$23:B$2914,Data!G$23:G$2914)","v":29299680},-644,2000,682,58]
[702,3,29809324,{"$f":"LOOKUP(A60,Data!B$23:B$2914,Data!G$23:G$2914)","v":29809440},-116,2000,694,59]
{"$rows_left_out":183}
{"sheet":"Zoom","index":4,"n_rows":11,"n_cols":9,"rows_kept":11}
[0,"= Current Zoom Level"]
["Level","Months","MajorTick","MinorTick","Shift","Connect","Years","YearsMajor","YearsMinor"]
[{"$f":"ROW()-3","v":0},{"$f":"2*MPC","v":2880},180,36,null,false,{"$f":"B3/12","v":240},8,2]
[1,{"$f":"B3/2","v":1440},{"$f":"2*48","v":96},12,{"$f":"B5","v":720},false,{"$f":"B4/12","v":120},8,2]
[2,{"$f":"B4/2","v":720},48,12,360,false,60,4,1]
[3,{"$f":"B5/2","v":360},24,6,180,false,30,2,1]
[4,{"$f":"B6/2","v":180},12,3,96,true,15,1,1]
[5,96,6,1,48,true,8,1,1]
[6,{"$f":"B8/2","v":48},3,1,24,true,4,1,1]
[7,{"$f":"B9/2","v":24},2,1,12,true,2,1,1]
[8,{"$f":"B10/2","v":12},1,1,12,true,1,1,1]

{"sheet":"Labels","index":5,"n_rows":28,"n_cols":3,"rows_kept":28}
["Lunar Year","Hours",{"$f":"\"Span \"&B2-B28&\"h\"","v":"Span 78h"}]
[241,33]
[{"$f":"A2","v":241},{"$f":"B2-3","v":30}]
[{"$f":"A3","v":241},{"$f":"B3-3","v":27}]
[{"$f":"A4","v":241},24]
[{"$f":"A5","v":241},21]
[241,18]
[241,15]
[241,12]
[241,9]
[241,6]
[241,3]
[241,0]
[241,-3]
[{"$f":"A14","v":241},{"$f":"B14-3","v":-6}]
[241,-9]
[241,-12]
[241,-15]
[241,-18]
[241,-21]
[241,-24]
[241,-27]
[241,-30]
[241,-33]
[241,-36]
[241,-39]
[241,-42]
[241,-45]