{"text_format":"3","workbook":"xlsx","n_sheets":7,"sheets":["Chart","Data","Years","Years2","Rules","Zoom","Labels"],"not_rendered":{"charts":1,"macros":1,"defined_names":16},"read":"whole","date_system":"1900"}

{"sheet":"Chart","index":0,"n_rows":38,"n_cols":17,"rows_kept":38}
["Lunar Cycle Jitter:  McKenna-Meyer Goddess Calendar"]
["http://www.fractal-timewave.com/mmgc/mmgc.htm"]
[{"$f":"\"Each lunar cycle contains \"&MPC&\" months (\"&FMPC&\" full, \"&DMPC&\" deficient) = \"&DPC&\" days = \"&reducefraction(DPC,7,FALSE,FALSE,TRUE)&\" weeks.\"","v":"Each lunar cycle contains 3055 months (1621 full, 1434 deficient) = 90216 days = 12888 weeks."}]
["Lunar years have 13 lunar months, even-numbered months have 29 days,"]
["odd-numbered months have 30 days, except that one day is removed from the last month"]
["of year numbers divisible by 10 or 235.  Each calendar cycle contains 2 lunar cycles = 470 lunar years."]
["Common year FDFDFDFDFDFDF=384 days, leap FDFDFDFDFDFDD=383 days."]
[{"$f":"\"Mean month = \"&\"29+\"&reducefraction(FMPC,MPC,FALSE,FALSE,TRUE)&\" days = 29d 12h 44m \"&reducefraction(240*(360*FMPC-191*MPC),MPC,FALSE,FALSE,TRUE)&\" seconds or about 29\"&MID(FMPC/MPC,2,20)&\" days = 29d 12h 44m \"&ROUND(240*(360*FMPC-191*MPC)/MPC,6)&\" seconds.\"","v":"Mean month = 29+1621/3055 days = 29d 12h 44m 4+196/611 seconds or about 29.530605564648118 days = 29d 12h 44m 4.320786 seconds."}]
[{"$f":"\"Duration per ''Part'' = 1/\"&MPC&\" day = \"&reducefraction(24,MPC,FALSE,FALSE,TRUE)&\" hour = \"&reducefraction(1440,MPC,FALSE,FALSE,TRUE)&\" minutes = \"&reducefraction(86400,MPC,FALSE,FALSE,TRUE)&\" seconds;  one hour = \"&reducefraction(MPC,24,FALSE,FALSE,TRUE)&\" parts.\"","v":"Duration per ''Part'' = 1/3055 day = 24/3055 hour = 288/611 minutes = 28+172/611 seconds;  one hour = 127+7/24 parts."}]
[]
[]
[{"$nulls":16},false]
{"$rows_empty":9}
[{"$nulls":16},13]
[{"$nulls":16},"Selected"]
[{"$nulls":16},"Month"]
[{"$nulls":16},"in Year"]
[{"$nulls":16},"(1 to 13)"]
{"$rows_empty":7}
[{"$nulls":16},2]
[{"$nulls":16},"Selected"]
[{"$nulls":16},"Month 2"]
[{"$nulls":16},"in Year"]
[{"$nulls":16},"(1 to 13)"]

{"sheet":"Data","index":1,"n_rows":6143,"n_cols":8,"rows_kept":6143}
["Lunar Cycle Jitter Evaluator"]
["by Dr. Irv Bromberg, University of Toronto, Canada"]
["http://individual.utoronto.ca/intervalmath/jitter/index.html",null,null,"Jitter","(parts)"]
[{"$nulls":3},{"$f":"MAX(H:H)","v":2617},"maximum",{"$f":"reducefraction(JitterMax*MPC,MPC,FALSE,FALSE,FALSE)","v":"2617"}]
["Months per Cycle (Parts per Day):",3055,"months (parts)",{"$f":"MIN(H:H)","v":-5672},"minimum",{"$f":"reducefraction(JitterMin*MPC,MPC,FALSE,FALSE,FALSE)","v":"–(5672)"}]
["30-day Months per Cycle:",1621,"months",{"$f":"D4-D5","v":8289},"range",{"$f":"reducefraction(JitterRange*MPC,MPC,FALSE,FALSE,FALSE)","v":"8289"}]
["29-day Months per Cycle:",{"$f":"MPC-FMPC","v":1434},"months",{"$f":"\"Jitter range = \"&F6&\" parts = \"&reducefraction(F6*24,MPC,FALSE,FALSE,FALSE)&\" hours\"","v":"Jitter range = 8289 parts = 65 + 361 / 3055 hours"}]
["Days per Cycle (Parts per Month):",{"$f":"29*MPC+FMPC","v":90216},"days (parts)"]
["Yerms per Cycle:",{"$f":"2*DPC-59*MPC","v":187},"yerms","Limits for Chart:"]
["Mean Month:",{"$f":"\"29 + \"&reducefraction(FMPC,MPC,FALSE,FALSE,FALSE)","v":"29 + 1621 / 3055"},"days","x","y","Hours"]
["Mean Month >29d:",{"$f":"FMPC/MPC","v":{"v":0.5306055646481178,"d":"0.530605564648118"}},"days",{"$f":"A21","v":1},{"$f":"JitterMax","v":2617},{"$f":"E11*24/MPC","v":20.559083469721767}]
["Mean Month >29d 12h 44m:",{"$f":"reducefraction(240*(360*FMPC-191*MPC),MPC,FALSE,FALSE,TRUE)","v":"4+196/611"},"seconds",{"$f":"D11+MPC*2","v":6111},{"$f":"E11","v":2617},{"$f":"E12*24/MPC","v":20.559083469721767}]
["… or approximately:",{"$f":"240*(360*FMPC-191*MPC)/MPC","v":4.3207855973813425},"seconds"]
[{"$nulls":3},{"$f":"D11","v":1},0]
[{"$nulls":3},{"$f":"D12","v":6111},0]
[]
[{"$nulls":3},{"$f":"A21","v":1},{"$f":"JitterMin","v":-5672},{"$f":"E17*24/MPC","v":-44.55908346972177}]
["Duration per Part:",{"$f":"reducefraction(1440,MPC,FALSE,FALSE,FALSE)","v":"288 / 611"},"minutes",{"$f":"D12","v":6111},{"$f":"E17","v":-5672},{"$f":"E18*24/MPC","v":-44.55908346972177}]
[]
["Month in Cycle","Lunar Year","Month in Year","Short Month?","Month Length","New Month Moment","Elapsed","Difference"]
[1,1,1,{"$f":"AND(OR(MOD(B21,235)=0,MOD(B21,10)=0),C21=13)","v":false},{"$f":"IF(MOD(C21,2)=1,30,29)-IF(D21,1,0)","v":30},0,0,{"$f":"F21-G21","v":0}]
[{"$f":"A21+1","v":2},{"$f":"IF(C22=1,B21+1,B21)","v":1},{"$f":"IF(C21=13,1,C21+1)","v":2},{"$f":"AND(OR(MOD(B22,235)=0,MOD(B22,10)=0),C22=13)","v":false},{"$f":"IF(MOD(C22,2)=1,30,29)-IF(D22,1,0)","v":29},{"$f":"F21+PPM","v":90216},{"$f":"G21+E21*PPD","v":91650},-1434]
[{"$f":"A22+1","v":3},1,{"$f":"IF(C22=13,1,C22+1)","v":3},false,30,{"$f":"F22+PPM","v":180432},180245,187]
[4,1,4,false,29,270648,271895,-1247]
[5,1,5,false,30,360864,360490,374]
[6,1,6,false,29,451080,452140,-1060]
[7,1,7,false,30,541296,540735,561]
[8,1,8,false,29,631512,632385,-873]
[9,1,9,false,30,721728,720980,748]
[10,1,10,false,29,811944,812630,-686]
[11,1,11,false,30,902160,901225,935]
[12,1,12,false,29,992376,992875,-499]
[13,1,13,false,30,1082592,1081470,1122]
[14,2,1,false,30,1172808,1173120,-312]
[15,2,2,false,29,1263024,1264770,-1746]
[16,2,3,false,30,1353240,1353365,-125]
[17,2,4,false,29,1443456,1445015,-1559]
[18,2,5,false,30,1533672,1533610,62]
[19,2,6,false,29,1623888,1625260,-1372]
[20,2,7,false,30,1714104,1713855,249]
[21,2,8,false,29,1804320,1805505,-1185]
[22,2,9,false,30,1894536,1894100,436]
[23,2,10,false,29,1984752,1985750,-998]
[24,2,11,false,30,2074968,2074345,623]
[25,2,12,false,29,2165184,2165995,-811]
[26,2,13,false,30,2255400,2254590,810]
[27,3,1,false,30,2345616,2346240,-624]
[28,3,2,false,29,2435832,2437890,-2058]
[29,3,3,false,30,2526048,2526485,-437]
[30,3,4,false,29,2616264,2618135,-1871]
[31,3,5,false,30,2706480,2706730,-250]
[32,3,6,false,29,2796696,2798380,-1684]
[33,3,7,false,30,2886912,2886975,-63]
[34,3,8,false,29,2977128,2978625,-1497]
[35,3,9,false,30,3067344,3067220,124]
[{"$f":"A55+1","v":36},3,10,false,29,3157560,3158870,-1310]
[37,3,11,false,30,3247776,3247465,311]
[38,3,12,false,29,3337992,3339115,-1123]
[39,3,13,false,30,3428208,3427710,498]
[40,4,1,false,30,3518424,3519360,-936]
[41,4,2,false,29,3608640,3611010,-2370]
[42,4,3,false,30,3698856,3699605,-749]
[43,4,4,false,29,3789072,3791255,-2183]
[44,4,5,false,30,3879288,3879850,-562]
[45,4,6,false,29,3969504,3971500,-1996]
[46,4,7,false,30,4059720,4060095,-375]
[47,4,8,false,29,4149936,4151745,-1809]
[48,4,9,false,30,4240152,4240340,-188]
[49,4,10,false,29,4330368,4331990,-1622]
[50,4,11,false,30,4420584,4420585,-1]
[51,4,12,false,29,4510800,4512235,-1435]
[52,4,13,false,30,4601016,4600830,186]
[53,5,1,false,30,4691232,4692480,-1248]
[54,5,2,false,29,4781448,4784130,-2682]
[55,5,3,false,30,4871664,4872725,-1061]
[56,5,4,false,29,4961880,4964375,-2495]
[57,5,5,false,30,5052096,5052970,-874]
[58,5,6,false,29,5142312,5144620,-2308]
[59,5,7,false,30,5232528,5233215,-687]
[60,5,8,false,29,5322744,5324865,-2121]
{"$rows_left_out":6064}
{"sheet":"Years","index":2,"n_rows":472,"n_cols":5,"rows_kept":472}
["Month in Cycle","Lunar Year","New Year Moment","Elapsed","Difference"]
[{"$f":"StartMonth","v":13},1,{"$f":"(A2-1)*PPM","v":1082592},{"$f":"LOOKUP(A2,Data!A$21:A$6143,Data!G$21:G$6143)","v":1081470},{"$f":"C2-D2","v":1122}]
[{"$f":"A2+13","v":26},{"$f":"B2+1","v":2},{"$f":"(A3-1)*PPM","v":2255400},{"$f":"LOOKUP(A3,Data!A$21:A$6143,Data!G$21:G$6143)","v":2254590},{"$f":"C3-D3","v":810}]
[{"$f":"A3+13","v":39},{"$f":"B3+1","v":3},3428208,{"$f":"LOOKUP(A4,Data!A$21:A$6143,Data!G$21:G$6143)","v":3427710},498]
[52,4,4601016,{"$f":"LOOKUP(A5,Data!A$21:A$6143,Data!G$21:G$6143)","v":4600830},186]
[65,5,5773824,{"$f":"LOOKUP(A6,Data!A$21:A$6143,Data!G$21:G$6143)","v":5773950},-126]
[78,6,6946632,{"$f":"LOOKUP(A7,Data!A$21:A$6143,Data!G$21:G$6143)","v":6947070},-438]
[91,7,8119440,{"$f":"LOOKUP(A8,Data!A$21:A$6143,Data!G$21:G$6143)","v":8120190},-750]
[104,8,9292248,{"$f":"LOOKUP(A9,Data!A$21:A$6143,Data!G$21:G$6143)","v":9293310},-1062]
[117,9,10465056,{"$f":"LOOKUP(A10,Data!A$21:A$6143,Data!G$21:G$6143)","v":10466430},-1374]
[130,10,11637864,{"$f":"LOOKUP(A11,Data!A$21:A$6143,Data!G$21:G$6143)","v":11639550},-1686]
[143,11,12810672,{"$f":"LOOKUP(A12,Data!A$21:A$6143,Data!G$21:G$6143)","v":12809615},1057]
[156,12,13983480,{"$f":"LOOKUP(A13,Data!A$21:A$6143,Data!G$21:G$6143)","v":13982735},745]
[169,13,15156288,{"$f":"LOOKUP(A14,Data!A$21:A$6143,Data!G$21:G$6143)","v":15155855},433]
[182,14,16329096,{"$f":"LOOKUP(A15,Data!A$21:A$6143,Data!G$21:G$6143)","v":16328975},121]
[195,15,17501904,{"$f":"LOOKUP(A16,Data!A$21:A$6143,Data!G$21:G$6143)","v":17502095},-191]
[208,16,18674712,{"$f":"LOOKUP(A17,Data!A$21:A$6143,Data!G$21:G$6143)","v":18675215},-503]
[221,17,19847520,{"$f":"LOOKUP(A18,Data!A$21:A$6143,Data!G$21:G$6143)","v":19848335},-815]
[234,18,21020328,{"$f":"LOOKUP(A19,Data!A$21:A$6143,Data!G$21:G$6143)","v":21021455},-1127]
[247,19,22193136,{"$f":"LOOKUP(A20,Data!A$21:A$6143,Data!G$21:G$6143)","v":22194575},-1439]
[260,20,23365944,{"$f":"LOOKUP(A21,Data!A$21:A$6143,Data!G$21:G$6143)","v":23367695},-1751]
[273,21,24538752,{"$f":"LOOKUP(A22,Data!A$21:A$6143,Data!G$21:G$6143)","v":24537760},992]
[286,22,25711560,{"$f":"LOOKUP(A23,Data!A$21:A$6143,Data!G$21:G$6143)","v":25710880},680]
[299,23,26884368,{"$f":"LOOKUP(A24,Data!A$21:A$6143,Data!G$21:G$6143)","v":26884000},368]
[312,24,28057176,{"$f":"LOOKUP(A25,Data!A$21:A$6143,Data!G$21:G$6143)","v":28057120},56]
[325,25,29229984,{"$f":"LOOKUP(A26,Data!A$21:A$6143,Data!G$21:G$6143)","v":29230240},-256]
[338,26,30402792,{"$f":"LOOKUP(A27,Data!A$21:A$6143,Data!G$21:G$6143)","v":30403360},-568]
[351,27,31575600,{"$f":"LOOKUP(A28,Data!A$21:A$6143,Data!G$21:G$6143)","v":31576480},-880]
[364,28,32748408,{"$f":"LOOKUP(A29,Data!A$21:A$6143,Data!G$21:G$6143)","v":32749600},-1192]
[377,29,33921216,{"$f":"LOOKUP(A30,Data!A$21:A$6143,Data!G$21:G$6143)","v":33922720},-1504]
[390,30,35094024,{"$f":"LOOKUP(A31,Data!A$21:A$6143,Data!G$21:G$6143)","v":35095840},-1816]
[403,31,36266832,{"$f":"LOOKUP(A32,Data!A$21:A$6143,Data!G$21:G$6143)","v":36265905},927]
[416,32,37439640,{"$f":"LOOKUP(A33,Data!A$21:A$6143,Data!G$21:G$6143)","v":37439025},615]
[429,33,38612448,{"$f":"LOOKUP(A34,Data!A$21:A$6143,Data!G$21:G$6143)","v":38612145},303]
[442,34,39785256,{"$f":"LOOKUP(A35,Data!A$21:A$6143,Data!G$21:G$6143)","v":39785265},-9]
[455,35,40958064,{"$f":"LOOKUP(A36,Data!A$21:A$6143,Data!G$21:G$6143)","v":40958385},-321]
[468,36,42130872,{"$f":"LOOKUP(A37,Data!A$21:A$6143,Data!G$21:G$6143)","v":42131505},-633]
[481,37,43303680,{"$f":"LOOKUP(A38,Data!A$21:A$6143,Data!G$21:G$6143)","v":43304625},-945]
[494,38,44476488,{"$f":"LOOKUP(A39,Data!A$21:A$6143,Data!G$21:G$6143)","v":44477745},-1257]
[507,39,45649296,{"$f":"LOOKUP(A40,Data!A$21:A$6143,Data!G$21:G$6143)","v":45650865},-1569]
[520,40,46822104,{"$f":"LOOKUP(A41,Data!A$21:A$6143,Data!G$21:G$6143)","v":46823985},-1881]
[533,41,47994912,{"$f":"LOOKUP(A42,Data!A$21:A$6143,Data!G$21:G$6143)","v":47994050},862]
[546,42,49167720,{"$f":"LOOKUP(A43,Data!A$21:A$6143,Data!G$21:G$6143)","v":49167170},550]
[559,43,50340528,{"$f":"LOOKUP(A44,Data!A$21:A$6143,Data!G$21:G$6143)","v":50340290},238]
[572,44,51513336,{"$f":"LOOKUP(A45,Data!A$21:A$6143,Data!G$21:G$6143)","v":51513410},-74]
[585,45,52686144,{"$f":"LOOKUP(A46,Data!A$21:A$6143,Data!G$21:G$6143)","v":52686530},-386]
[598,46,53858952,{"$f":"LOOKUP(A47,Data!A$21:A$6143,Data!G$21:G$6143)","v":53859650},-698]
[611,47,55031760,{"$f":"LOOKUP(A48,Data!A$21:A$6143,Data!G$21:G$6143)","v":55032770},-1010]
[624,48,56204568,{"$f":"LOOKUP(A49,Data!A$21:A$6143,Data!G$21:G$6143)","v":56205890},-1322]
[637,49,57377376,{"$f":"LOOKUP(A50,Data!A$21:A$6143,Data!G$21:G$6143)","v":57379010},-1634]
[650,50,58550184,{"$f":"LOOKUP(A51,Data!A$21:A$6143,Data!G$21:G$6143)","v":58552130},-1946]
[663,51,59722992,{"$f":"LOOKUP(A52,Data!A$21:A$6143,Data!G$21:G$6143)","v":59722195},797]
[676,52,60895800,{"$f":"LOOKUP(A53,Data!A$21:A$6143,Data!G$21:G$6143)","v":60895315},485]
[689,53,62068608,{"$f":"LOOKUP(A54,Data!A$21:A$6143,Data!G$21:G$6143)","v":62068435},173]
[702,54,63241416,{"$f":"LOOKUP(A55,Data!A$21:A$6143,Data!G$21:G$6143)","v":63241555},-139]
[715,55,64414224,{"$f":"LOOKUP(A56,Data!A$21:A$6143,Data!G$21:G$6143)","v":64414675},-451]
[728,56,65587032,{"$f":"LOOKUP(A57,Data!A$21:A$6143,Data!G$21:G$6143)","v":65587795},-763]
[741,57,66759840,{"$f":"LOOKUP(A58,Data!A$21:A$6143,Data!G$21:G$6143)","v":66760915},-1075]
[754,58,67932648,{"$f":"LOOKUP(A59,Data!A$21:A$6143,Data!G$21:G$6143)","v":67934035},-1387]
[767,59,69105456,{"$f":"LOOKUP(A60,Data!A$21:A$6143,Data!G$21:G$6143)","v":69107155},-1699]
[780,60,70278264,{"$f":"LOOKUP(A61,Data!A$21:A$6143,Data!G$21:G$6143)","v":70280275},-2011]
[793,61,71451072,{"$f":"LOOKUP(A62,Data!A$21:A$6143,Data!G$21:G$6143)","v":71450340},732]
[806,62,72623880,{"$f":"LOOKUP(A63,Data!A$21:A$6143,Data!G$21:G$6143)","v":72623460},420]
[819,63,73796688,{"$f":"LOOKUP(A64,Data!A$21:A$6143,Data!G$21:G$6143)","v":73796580},108]
[832,64,74969496,{"$f":"LOOKUP(A65,Data!A$21:A$6143,Data!G$21:G$6143)","v":74969700},-204]
[845,65,76142304,{"$f":"LOOKUP(A66,Data!A$21:A$6143,Data!G$21:G$6143)","v":76142820},{"$f":"C66-D66","v":-516}]
[858,66,{"$f":"(A67-1)*PPM","v":77315112},{"$f":"LOOKUP(A67,Data!A$21:A$6143,Data!G$21:G$6143)","v":77315940},-828]
[{"$f":"A67+13","v":871},{"$f":"B67+1","v":67},78487920,{"$f":"LOOKUP(A68,Data!A$21:A$6143,Data!G$21:G$6143)","v":78489060},-1140]
[884,68,79660728,{"$f":"LOOKUP(A69,Data!A$21:A$6143,Data!G$21:G$6143)","v":79662180},-1452]
[897,69,80833536,{"$f":"LOOKUP(A70,Data!A$21:A$6143,Data!G$21:G$6143)","v":80835300},-1764]
[910,70,82006344,{"$f":"LOOKUP(A71,Data!A$21:A$6143,Data!G$21:G$6143)","v":82008420},-2076]
[923,71,83179152,{"$f":"LOOKUP(A72,Data!A$21:A$6143,Data!G$21:G$6143)","v":83178485},667]
[936,72,84351960,{"$f":"LOOKUP(A73,Data!A$21:A$6143,Data!G$21:G$6143)","v":84351605},355]
[949,73,85524768,{"$f":"LOOKUP(A74,Data!A$21:A$6143,Data!G$21:G$6143)","v":85524725},43]
[962,74,86697576,{"$f":"LOOKUP(A75,Data!A$21:A$6143,Data!G$21:G$6143)","v":86697845},-269]
[975,75,87870384,{"$f":"LOOKUP(A76,Data!A$21:A$6143,Data!G$21:G$6143)","v":87870965},-581]
[988,76,89043192,{"$f":"LOOKUP(A77,Data!A$21:A$6143,Data!G$21:G$6143)","v":89044085},-893]
[1001,77,90216000,{"$f":"LOOKUP(A78,Data!A$21:A$6143,Data!G$21:G$6143)","v":90217205},-1205]
[1014,78,91388808,{"$f":"LOOKUP(A79,Data!A$21:A$6143,Data!G$21:G$6143)","v":91390325},-1517]
[1027,79,92561616,{"$f":"LOOKUP(A80,Data!A$21:A$6143,Data!G$21:G$6143)","v":92563445},-1829]
{"$rows_left_out":393}
{"sheet":"Years2","index":3,"n_rows":472,"n_cols":5,"rows_kept":472}
["Month in Cycle","Lunar Year","New Year Moment","Elapsed","Difference"]
[{"$f":"StartMonth2","v":2},1,{"$f":"(A2-1)*PPM","v":90216},{"$f":"LOOKUP(A2,Data!A$21:A$6143,Data!G$21:G$6143)","v":91650},{"$f":"C2-D2","v":-1434}]
[{"$f":"A2+13","v":15},{"$f":"B2+1","v":2},1263024,{"$f":"LOOKUP(A3,Data!A$21:A$6143,Data!G$21:G$6143)","v":1264770},-1746]
[28,3,2435832,{"$f":"LOOKUP(A4,Data!A$21:A$6143,Data!G$21:G$6143)","v":2437890},-2058]
[41,4,3608640,{"$f":"LOOKUP(A5,Data!A$21:A$6143,Data!G$21:G$6143)","v":3611010},-2370]
[54,5,4781448,{"$f":"LOOKUP(A6,Data!A$21:A$6143,Data!G$21:G$6143)","v":4784130},-2682]
[67,6,5954256,{"$f":"LOOKUP(A7,Data!A$21:A$6143,Data!G$21:G$6143)","v":5957250},-2994]
[80,7,7127064,{"$f":"LOOKUP(A8,Data!A$21:A$6143,Data!G$21:G$6143)","v":7130370},-3306]
[93,8,8299872,{"$f":"LOOKUP(A9,Data!A$21:A$6143,Data!G$21:G$6143)","v":8303490},-3618]
[106,9,9472680,{"$f":"LOOKUP(A10,Data!A$21:A$6143,Data!G$21:G$6143)","v":9476610},-3930]
[119,10,10645488,{"$f":"LOOKUP(A11,Data!A$21:A$6143,Data!G$21:G$6143)","v":10649730},-4242]
[132,11,11818296,{"$f":"LOOKUP(A12,Data!A$21:A$6143,Data!G$21:G$6143)","v":11819795},-1499]
[145,12,12991104,{"$f":"LOOKUP(A13,Data!A$21:A$6143,Data!G$21:G$6143)","v":12992915},-1811]
[158,13,14163912,{"$f":"LOOKUP(A14,Data!A$21:A$6143,Data!G$21:G$6143)","v":14166035},-2123]
[171,14,15336720,{"$f":"LOOKUP(A15,Data!A$21:A$6143,Data!G$21:G$6143)","v":15339155},-2435]
[184,15,16509528,{"$f":"LOOKUP(A16,Data!A$21:A$6143,Data!G$21:G$6143)","v":16512275},-2747]
[197,16,17682336,{"$f":"LOOKUP(A17,Data!A$21:A$6143,Data!G$21:G$6143)","v":17685395},-3059]
[210,17,18855144,{"$f":"LOOKUP(A18,Data!A$21:A$6143,Data!G$21:G$6143)","v":18858515},-3371]
[223,18,20027952,{"$f":"LOOKUP(A19,Data!A$21:A$6143,Data!G$21:G$6143)","v":20031635},-3683]
[236,19,21200760,{"$f":"LOOKUP(A20,Data!A$21:A$6143,Data!G$21:G$6143)","v":21204755},-3995]
[249,20,22373568,{"$f":"LOOKUP(A21,Data!A$21:A$6143,Data!G$21:G$6143)","v":22377875},-4307]
[262,21,23546376,{"$f":"LOOKUP(A22,Data!A$21:A$6143,Data!G$21:G$6143)","v":23547940},-1564]
[275,22,24719184,{"$f":"LOOKUP(A23,Data!A$21:A$6143,Data!G$21:G$6143)","v":24721060},-1876]
[288,23,25891992,{"$f":"LOOKUP(A24,Data!A$21:A$6143,Data!G$21:G$6143)","v":25894180},-2188]
[301,24,27064800,{"$f":"LOOKUP(A25,Data!A$21:A$6143,Data!G$21:G$6143)","v":27067300},-2500]
[314,25,28237608,{"$f":"LOOKUP(A26,Data!A$21:A$6143,Data!G$21:G$6143)","v":28240420},-2812]
[327,26,29410416,{"$f":"LOOKUP(A27,Data!A$21:A$6143,Data!G$21:G$6143)","v":29413540},-3124]
[340,27,30583224,{"$f":"LOOKUP(A28,Data!A$21:A$6143,Data!G$21:G$6143)","v":30586660},-3436]
[353,28,31756032,{"$f":"LOOKUP(A29,Data!A$21:A$6143,Data!G$21:G$6143)","v":31759780},-3748]
[366,29,32928840,{"$f":"LOOKUP(A30,Data!A$21:A$6143,Data!G$21:G$6143)","v":32932900},-4060]
[379,30,34101648,{"$f":"LOOKUP(A31,Data!A$21:A$6143,Data!G$21:G$6143)","v":34106020},-4372]
[392,31,35274456,{"$f":"LOOKUP(A32,Data!A$21:A$6143,Data!G$21:G$6143)","v":35276085},-1629]
[405,32,36447264,{"$f":"LOOKUP(A33,Data!A$21:A$6143,Data!G$21:G$6143)","v":36449205},-1941]
[418,33,37620072,{"$f":"LOOKUP(A34,Data!A$21:A$6143,Data!G$21:G$6143)","v":37622325},-2253]
[431,34,38792880,{"$f":"LOOKUP(A35,Data!A$21:A$6143,Data!G$21:G$6143)","v":38795445},-2565]
[444,35,39965688,{"$f":"LOOKUP(A36,Data!A$21:A$6143,Data!G$21:G$6143)","v":39968565},-2877]
[457,36,41138496,{"$f":"LOOKUP(A37,Data!A$21:A$6143,Data!G$21:G$6143)","v":41141685},-3189]
[470,37,42311304,{"$f":"LOOKUP(A38,Data!A$21:A$6143,Data!G$21:G$6143)","v":42314805},-3501]
[483,38,43484112,{"$f":"LOOKUP(A39,Data!A$21:A$6143,Data!G$21:G$6143)","v":43487925},-3813]
[496,39,44656920,{"$f":"LOOKUP(A40,Data!A$21:A$6143,Data!G$21:G$6143)","v":44661045},-4125]
[509,40,45829728,{"$f":"LOOKUP(A41,Data!A$21:A$6143,Data!G$21:G$6143)","v":45834165},-4437]
[522,41,47002536,{"$f":"LOOKUP(A42,Data!A$21:A$6143,Data!G$21:G$6143)","v":47004230},-1694]
[535,42,48175344,{"$f":"LOOKUP(A43,Data!A$21:A$6143,Data!G$21:G$6143)","v":48177350},-2006]
[548,43,49348152,{"$f":"LOOKUP(A44,Data!A$21:A$6143,Data!G$21:G$6143)","v":49350470},-2318]
[561,44,50520960,{"$f":"LOOKUP(A45,Data!A$21:A$6143,Data!G$21:G$6143)","v":50523590},-2630]
[574,45,51693768,{"$f":"LOOKUP(A46,Data!A$21:A$6143,Data!G$21:G$6143)","v":51696710},-2942]
[587,46,52866576,{"$f":"LOOKUP(A47,Data!A$21:A$6143,Data!G$21:G$6143)","v":52869830},-3254]
[600,47,54039384,{"$f":"LOOKUP(A48,Data!A$21:A$6143,Data!G$21:G$6143)","v":54042950},-3566]
[613,48,55212192,{"$f":"LOOKUP(A49,Data!A$21:A$6143,Data!G$21:G$6143)","v":55216070},-3878]
[626,49,56385000,{"$f":"LOOKUP(A50,Data!A$21:A$6143,Data!G$21:G$6143)","v":56389190},-4190]
[639,50,57557808,{"$f":"LOOKUP(A51,Data!A$21:A$6143,Data!G$21:G$6143)","v":57562310},-4502]
[652,51,58730616,{"$f":"LOOKUP(A52,Data!A$21:A$6143,Data!G$21:G$6143)","v":58732375},-1759]
[665,52,59903424,{"$f":"LOOKUP(A53,Data!A$21:A$6143,Data!G$21:G$6143)","v":59905495},-2071]
[678,53,61076232,{"$f":"LOOKUP(A54,Data!A$21:A$6143,Data!G$21:G$6143)","v":61078615},-2383]
[691,54,62249040,{"$f":"LOOKUP(A55,Data!A$21:A$6143,Data!G$21:G$6143)","v":62251735},-2695]
[704,55,63421848,{"$f":"LOOKUP(A56,Data!A$21:A$6143,Data!G$21:G$6143)","v":63424855},-3007]
[717,56,64594656,{"$f":"LOOKUP(A57,Data!A$21:A$6143,Data!G$21:G$6143)","v":64597975},-3319]
[730,57,65767464,{"$f":"LOOKUP(A58,Data!A$21:A$6143,Data!G$21:G$6143)","v":65771095},-3631]
[743,58,66940272,{"$f":"LOOKUP(A59,Data!A$21:A$6143,Data!G$21:G$6143)","v":66944215},-3943]
[756,59,68113080,{"$f":"LOOKUP(A60,Data!A$21:A$6143,Data!G$21:G$6143)","v":68117335},-4255]
[769,60,69285888,{"$f":"LOOKUP(A61,Data!A$21:A$6143,Data!G$21:G$6143)","v":69290455},-4567]
[782,61,70458696,{"$f":"LOOKUP(A62,Data!A$21:A$6143,Data!G$21:G$6143)","v":70460520},-1824]
[795,62,71631504,{"$f":"LOOKUP(A63,Data!A$21:A$6143,Data!G$21:G$6143)","v":71633640},-2136]
[808,63,72804312,{"$f":"LOOKUP(A64,Data!A$21:A$6143,Data!G$21:G$6143)","v":72806760},-2448]
[821,64,73977120,{"$f":"LOOKUP(A65,Data!A$21:A$6143,Data!G$21:G$6143)","v":73979880},-2760]
[834,65,{"$f":"(A66-1)*PPM","v":75149928},{"$f":"LOOKUP(A66,Data!A$21:A$6143,Data!G$21:G$6143)","v":75153000},{"$f":"C66-D66","v":-3072}]
[{"$f":"A66+13","v":847},{"$f":"B66+1","v":66},76322736,{"$f":"LOOKUP(A67,Data!A$21:A$6143,Data!G$21:G$6143)","v":76326120},-3384]
[860,67,77495544,{"$f":"LOOKUP(A68,Data!A$21:A$6143,Data!G$21:G$6143)","v":77499240},-3696]
[873,68,78668352,{"$f":"LOOKUP(A69,Data!A$21:A$6143,Data!G$21:G$6143)","v":78672360},-4008]
[886,69,79841160,{"$f":"LOOKUP(A70,Data!A$21:A$6143,Data!G$21:G$6143)","v":79845480},-4320]
[899,70,81013968,{"$f":"LOOKUP(A71,Data!A$21:A$6143,Data!G$21:G$6143)","v":81018600},-4632]
[912,71,82186776,{"$f":"LOOKUP(A72,Data!A$21:A$6143,Data!G$21:G$6143)","v":82188665},-1889]
[925,72,83359584,{"$f":"LOOKUP(A73,Data!A$21:A$6143,Data!G$21:G$6143)","v":83361785},-2201]
[938,73,84532392,{"$f":"LOOKUP(A74,Data!A$21:A$6143,Data!G$21:G$6143)","v":84534905},-2513]
[951,74,85705200,{"$f":"LOOKUP(A75,Data!A$21:A$6143,Data!G$21:G$6143)","v":85708025},-2825]
[964,75,86878008,{"$f":"LOOKUP(A76,Data!A$21:A$6143,Data!G$21:G$6143)","v":86881145},-3137]
[977,76,88050816,{"$f":"LOOKUP(A77,Data!A$21:A$6143,Data!G$21:G$6143)","v":88054265},-3449]
[990,77,89223624,{"$f":"LOOKUP(A78,Data!A$21:A$6143,Data!G$21:G$6143)","v":89227385},-3761]
[1003,78,90396432,{"$f":"LOOKUP(A79,Data!A$21:A$6143,Data!G$21:G$6143)","v":90400505},-4073]
[1016,79,91569240,{"$f":"LOOKUP(A80,Data!A$21:A$6143,Data!G$21:G$6143)","v":91573625},-4385]
{"$rows_left_out":393}
{"sheet":"Rules","index":4,"n_rows":13,"n_cols":3,"rows_kept":13}
["Lunar year has 13 months"]
["470 thirteen-month lunar years per cycle"]
[{"$f":"470*13","v":6110},"months"]
["odd-numbered months have 30 days, even numbered months have 29 days"]
["so common years have 7 full months and 6 deficient months"]
["length of common year =",{"$f":"6*29+7*30","v":384}]
["but when the year number is divisible by 10 or 235 one day is removed from the last month"]
["so instead of having",{"$f":"7*470","v":3290},"full months per cycle"]
[null,47,"are removed for years divisible by 10"]
[null,1,"is removed for years divisible by 235 (470 is already a leap year because it is divisible by 10)"]
[null,{"$f":"B8-B9-B10","v":3242}]
[{"$f":"\"so the mean month = 29+\"&B11&\"/\"&A3&\" days = 29+\"&reducefraction(3242,6110,FALSE,FALSE,TRUE)&\" days\"","v":"so the mean month = 29+3242/6110 days = 29+1621/3055 days"}]
["and so the overall calendar cycle is a double lunar cycle."]

{"sheet":"Zoom","index":5,"n_rows":12,"n_cols":9,"rows_kept":12}
[0,"= Current Zoom Level"]
["Level","Months","MajorTick","MinorTick","Shift","Connect","Years","YearsMajor","YearsMinor"]
[{"$f":"ROW()-3","v":0},{"$f":"2*MPC","v":6110},520,52,null,false,{"$f":"B3/13","v":470},20,5]
[1,{"$f":"B5*2","v":3328},260,26,{"$f":"B5","v":1664},false,{"$f":"B4/13","v":256},10,2]
[2,1664,130,13,832,false,{"$f":"B5/13","v":128},5,1]
[3,832,52,13,416,false,64,2,1]
[4,416,13,13,208,false,32,1,1]
[5,208,13,13,104,true,16,1,1]
[6,104,13,1,52,true,8,1,{"$f":"1/13","v":0.07692307692307693}]
[7,52,13,1,26,true,4,1,{"$f":"1/13","v":0.07692307692307693}]
[8,{"$f":"B12*2","v":26},1,1,{"$f":"B12","v":13},true,2,1,{"$f":"1/13","v":0.07692307692307693}]
[9,13,1,1,13,true,1,1,{"$f":"1/13","v":0.07692307692307693}]

{"sheet":"Labels","index":6,"n_rows":28,"n_cols":3,"rows_kept":28}
["Lunar Year","Hours",{"$f":"\"Span \"&B2-B28&\"h\"","v":"Span 78h"}]
[471,30]
[{"$f":"A2","v":471},{"$f":"B2-3","v":27}]
[{"$f":"A3","v":471},{"$f":"B3-3","v":24}]
[{"$f":"A4","v":471},21]
[{"$f":"A5","v":471},18]
[471,15]
[471,12]
[471,9]
[471,6]
[471,3]
[471,0]
[471,-3]
[471,-6]
[471,-9]
[{"$f":"A15","v":471},{"$f":"B15-3","v":-12}]
[471,-15]
[471,-18]
[471,-21]
[471,-24]
[471,-27]
[471,-30]
[471,-33]
[{"$f":"A23","v":471},{"$f":"B23-3","v":-36}]
[{"$f":"A24","v":471},{"$f":"B24-3","v":-39}]
[{"$f":"A25","v":471},{"$f":"B25-3","v":-42}]
[{"$f":"A26","v":471},{"$f":"B26-3","v":-45}]
[{"$f":"A27","v":471},{"$f":"B27-3","v":-48}]