{"text_format":"3","workbook":"xlsx","n_sheets":7,"sheets":["Chart","Data","Rules","Years","Years2","Zoom","Labels"],"not_rendered":{"charts":1,"macros":1,"defined_names":16},"read":"whole","date_system":"1900"}

{"sheet":"Chart","index":0,"n_rows":37,"n_cols":17,"rows_kept":37}
["Lunar Cycle Jitter:  Palmen-McKenna Calendar"]
["http://www.hermetic.ch/cal_stud/palmen/lunar13.htm"]
[{"$f":"\"Each lunar cycle contains \"&MPC&\" months (\"&FMPC&\" full, \"&DMPC&\" deficient) = \"&DPC&\" days = \"&reducefraction(DPC,7,FALSE,FALSE,TRUE)&\" weeks.\"","v":"Each lunar cycle contains 2418 months (1283 full, 1135 deficient) = 71405 days = 10200+5/7 weeks."}]
["Lunar years have 13 lunar months, even-numbered months have 29 days, odd-numbered"]
["months have 30 days, except that one day is removed from the last month of the lunar year if and only if"]
["(19 x year – 1) MOD 186 < 19.  Each calendar cycle contains two 186-year lunar cycles = 372 lunar years."]
[{"$f":"\"Mean month = \"&\"29+\"&reducefraction(FMPC,MPC,FALSE,FALSE,TRUE)&\" days = 29d 12h 44m and \"&reducefraction(240*(360*FMPC-191*MPC),MPC,FALSE,FALSE,TRUE)&\" seconds\"","v":"Mean month = 29+1283/2418 days = 29d 12h 44m and 4+68/403 seconds"}]
[{"$f":"\"or approximately 29\"&MID(FMPC/MPC,2,20)&\" days = 29d 12h 44m and \"&ROUND(240*(360*FMPC-191*MPC)/MPC,6)&\" seconds.\"","v":"or approximately 29.530603804797353 days = 29d 12h 44m and 4.168734 seconds."}]
[{"$f":"\"Duration per ''Part'' = 1/\"&MPC&\" day = \"&reducefraction(24,MPC,FALSE,FALSE,TRUE)&\" hour = \"&reducefraction(1440,MPC,FALSE,FALSE,TRUE)&\" minutes = \"&reducefraction(86400,MPC,FALSE,FALSE,TRUE)&\" seconds;  one hour = \"&reducefraction(MPC,24,FALSE,FALSE,TRUE)&\" parts.\"","v":"Duration per ''Part'' = 1/2418 day = 4/403 hour = 240/403 minutes = 35+295/403 seconds;  one hour = 100+3/4 parts."}]
[]
[{"$nulls":16},false]
{"$rows_empty":9}
[{"$nulls":16},13]
[{"$nulls":16},"Selected"]
[{"$nulls":16},"Month"]
[{"$nulls":16},"in Year"]
[{"$nulls":16},"(1 to 13)"]
{"$rows_empty":7}
[{"$nulls":16},2]
[{"$nulls":16},"Selected"]
[{"$nulls":16},"Month"]
[{"$nulls":16},"in Year"]
[{"$nulls":16},"(1 to 13)"]

{"sheet":"Data","index":1,"n_rows":4869,"n_cols":8,"rows_kept":4869}
["Lunar Cycle Jitter Evaluator"]
["by Dr. Irv Bromberg, University of Toronto, Canada"]
["http://individual.utoronto.ca/intervalmath/jitter/index.html",null,null,"Jitter","(parts)"]
[{"$nulls":3},{"$f":"MAX(H:H)","v":3293},"maximum",{"$f":"reducefraction(JitterMax*MPC,MPC,FALSE,FALSE,FALSE)","v":"3293"}]
["Months per Cycle (Parts per Day):",2418,"months (parts)",{"$f":"MIN(H:H)","v":-1135},"minimum",{"$f":"reducefraction(JitterMin*MPC,MPC,FALSE,FALSE,FALSE)","v":"–(1135)"}]
["30-day Months per Cycle:",1283,"months",{"$f":"D4-D5","v":4428},"range",{"$f":"reducefraction(JitterRange*MPC,MPC,FALSE,FALSE,FALSE)","v":"4428"}]
["29-day Months per Cycle:",{"$f":"MPC-FMPC","v":1135},"months",{"$f":"\"Jitter range = \"&F6&\" parts = \"&reducefraction(F6*24,MPC,FALSE,FALSE,FALSE)&\" hours\"","v":"Jitter range = 4428 parts = 43 + 383 / 403 hours"}]
["Days per Cycle (Parts per Month):",{"$f":"29*MPC+FMPC","v":71405},"days (parts)"]
[{"$nulls":3},"Limits for Chart:"]
["Mean Month:",{"$f":"\"29 + \"&reducefraction(FMPC,MPC,FALSE,FALSE,FALSE)","v":"29 + 1283 / 2418"},"days","x","y","Hours"]
["Mean Month >29d:",{"$f":"FMPC/MPC","v":{"v":0.5306038047973531,"d":"0.530603804797353"}},"days",{"$f":"A21","v":1},{"$f":"JitterMax","v":3293},{"$f":"E11*24/MPC","v":32.6848635235732}]
["Mean Month >29d 12h 44m:",{"$f":"reducefraction(240*(360*FMPC-191*MPC),MPC,FALSE,FALSE,TRUE)","v":"4+68/403"},"seconds",{"$f":"D11+MPC*2","v":4837},{"$f":"E11","v":3293},{"$f":"E12*24/MPC","v":32.6848635235732}]
["… or approximately:",{"$f":"240*(360*FMPC-191*MPC)/MPC","v":4.168734491315137},"seconds"]
[{"$nulls":3},{"$f":"D11","v":1},0]
[{"$nulls":3},{"$f":"D12","v":4837},0]
[]
[{"$nulls":3},{"$f":"A21","v":1},{"$f":"JitterMin","v":-1135},{"$f":"E17*24/MPC","v":-11.265508684863523}]
["Duration per Part:",{"$f":"reducefraction(1440,MPC,FALSE,FALSE,FALSE)","v":"240 / 403"},"minutes",{"$f":"D12","v":4837},{"$f":"E17","v":-1135},{"$f":"E18*24/MPC","v":-11.265508684863523}]
[]
["Month in Cycle","Lunar Year","Month in Year","Short Month?","Month Length","New Month Moment","Elapsed","Difference"]
[1,1,1,{"$f":"AND(C21=13,MOD(19*B21-1,186)<19)","v":false},{"$f":"IF(MOD(C21,2)=1,30,29)-IF(D21,1,0)","v":30},0,0,{"$f":"F21-G21","v":0}]
[{"$f":"A21+1","v":2},{"$f":"IF(C22=1,B21+1,B21)","v":1},{"$f":"IF(C21=13,1,C21+1)","v":2},{"$f":"AND(C22=13,MOD(19*B22-1,186)<19)","v":false},{"$f":"IF(MOD(C22,2)=1,30,29)-IF(D22,1,0)","v":29},{"$f":"F21+PPM","v":71405},{"$f":"G21+E21*PPD","v":72540},-1135]
[{"$f":"A22+1","v":3},1,{"$f":"IF(C22=13,1,C22+1)","v":3},false,30,{"$f":"F22+PPM","v":142810},142662,148]
[4,1,4,false,29,214215,215202,-987]
[5,1,5,false,30,285620,285324,296]
[6,1,6,false,29,357025,357864,-839]
[7,1,7,false,30,428430,427986,444]
[8,1,8,false,29,499835,500526,-691]
[9,1,9,false,30,571240,570648,592]
[10,1,10,false,29,642645,643188,-543]
[11,1,11,false,30,714050,713310,740]
[12,1,12,false,29,785455,785850,-395]
[13,1,13,true,29,856860,855972,888]
[14,2,1,false,30,928265,926094,2171]
[15,2,2,false,29,999670,998634,1036]
[16,2,3,false,30,1071075,1068756,2319]
[17,2,4,false,29,1142480,1141296,1184]
[18,2,5,false,30,1213885,1211418,2467]
[19,2,6,false,29,1285290,1283958,1332]
[20,2,7,false,30,1356695,1354080,2615]
[21,2,8,false,29,1428100,1426620,1480]
[22,2,9,false,30,1499505,1496742,2763]
[23,2,10,false,29,1570910,1569282,1628]
[24,2,11,false,30,1642315,1639404,2911]
[25,2,12,false,29,1713720,1711944,1776]
[26,2,13,false,30,1785125,1782066,3059]
[27,3,1,false,30,1856530,1854606,1924]
[28,3,2,false,29,1927935,1927146,789]
[29,3,3,false,30,1999340,1997268,2072]
[30,3,4,false,29,2070745,2069808,937]
[31,3,5,false,30,2142150,2139930,2220]
[32,3,6,false,29,2213555,2212470,1085]
[33,3,7,false,30,2284960,2282592,2368]
[34,3,8,false,29,2356365,2355132,1233]
[35,3,9,false,30,2427770,2425254,2516]
[{"$f":"A55+1","v":36},3,10,false,29,2499175,2497794,1381]
[37,3,11,false,30,2570580,2567916,2664]
[38,3,12,false,29,2641985,2640456,1529]
[39,3,13,false,30,2713390,2710578,2812]
[40,4,1,false,30,2784795,2783118,1677]
[41,4,2,false,29,2856200,2855658,542]
[42,4,3,false,30,2927605,2925780,1825]
[43,4,4,false,29,2999010,2998320,690]
[44,4,5,false,30,3070415,3068442,1973]
[45,4,6,false,29,3141820,3140982,838]
[46,4,7,false,30,3213225,3211104,2121]
[47,4,8,false,29,3284630,3283644,986]
[48,4,9,false,30,3356035,3353766,2269]
[49,4,10,false,29,3427440,3426306,1134]
[50,4,11,false,30,3498845,3496428,2417]
[51,4,12,false,29,3570250,3568968,1282]
[52,4,13,false,30,3641655,3639090,2565]
[53,5,1,false,30,3713060,3711630,1430]
[54,5,2,false,29,3784465,3784170,295]
[55,5,3,false,30,3855870,3854292,1578]
[56,5,4,false,29,3927275,3926832,443]
[57,5,5,false,30,3998680,3996954,1726]
[58,5,6,false,29,4070085,4069494,591]
[59,5,7,false,30,4141490,4139616,1874]
[60,5,8,false,29,4212895,4212156,739]
{"$rows_left_out":4790}
{"sheet":"Rules","index":2,"n_rows":9,"n_cols":3,"rows_kept":9}
["lunar year has 13 months"]
["odd-numbered months have 30 days, even numbered months have 29 days"]
["so common years have 7 full months and 6 deficient months"]
["length of common year =",{"$f":"6*29+7*30","v":384},"days"]
["in short years remove one day from 13th month = 383 days"]
["A lunar year is short if it has two occurrences of either of:"]
["-- Solar date Month 1 Date 1 (new solar year)  OR"]
["-- Solar date Month 7 Date 1 (half solar year) "]
["A lunar year y is short if and only if (19*y-1) mod 186 < 19"]

{"sheet":"Years","index":3,"n_rows":374,"n_cols":5,"rows_kept":374}
["Month in Cycle","Lunar Year","New Year Moment","Elapsed","Difference"]
[{"$f":"StartMonth","v":13},1,{"$f":"(A2-1)*PPM","v":856860},{"$f":"LOOKUP(A2,Data!A$21:A$4869,Data!G$21:G$4869)","v":855972},{"$f":"C2-D2","v":888}]
[{"$f":"A2+13","v":26},{"$f":"B2+1","v":2},{"$f":"(A3-1)*PPM","v":1785125},{"$f":"LOOKUP(A3,Data!A$21:A$4869,Data!G$21:G$4869)","v":1782066},{"$f":"C3-D3","v":3059}]
[{"$f":"A3+13","v":39},{"$f":"B3+1","v":3},2713390,{"$f":"LOOKUP(A4,Data!A$21:A$4869,Data!G$21:G$4869)","v":2710578},2812]
[52,4,3641655,{"$f":"LOOKUP(A5,Data!A$21:A$4869,Data!G$21:G$4869)","v":3639090},2565]
[65,5,4569920,{"$f":"LOOKUP(A6,Data!A$21:A$4869,Data!G$21:G$4869)","v":4567602},2318]
[78,6,5498185,{"$f":"LOOKUP(A7,Data!A$21:A$4869,Data!G$21:G$4869)","v":5496114},2071]
[91,7,6426450,{"$f":"LOOKUP(A8,Data!A$21:A$4869,Data!G$21:G$4869)","v":6424626},1824]
[104,8,7354715,{"$f":"LOOKUP(A9,Data!A$21:A$4869,Data!G$21:G$4869)","v":7353138},1577]
[117,9,8282980,{"$f":"LOOKUP(A10,Data!A$21:A$4869,Data!G$21:G$4869)","v":8281650},1330]
[130,10,9211245,{"$f":"LOOKUP(A11,Data!A$21:A$4869,Data!G$21:G$4869)","v":9210162},1083]
[143,11,10139510,{"$f":"LOOKUP(A12,Data!A$21:A$4869,Data!G$21:G$4869)","v":10136256},3254]
[156,12,11067775,{"$f":"LOOKUP(A13,Data!A$21:A$4869,Data!G$21:G$4869)","v":11064768},3007]
[169,13,11996040,{"$f":"LOOKUP(A14,Data!A$21:A$4869,Data!G$21:G$4869)","v":11993280},2760]
[182,14,12924305,{"$f":"LOOKUP(A15,Data!A$21:A$4869,Data!G$21:G$4869)","v":12921792},2513]
[195,15,13852570,{"$f":"LOOKUP(A16,Data!A$21:A$4869,Data!G$21:G$4869)","v":13850304},2266]
[208,16,14780835,{"$f":"LOOKUP(A17,Data!A$21:A$4869,Data!G$21:G$4869)","v":14778816},2019]
[221,17,15709100,{"$f":"LOOKUP(A18,Data!A$21:A$4869,Data!G$21:G$4869)","v":15707328},1772]
[234,18,16637365,{"$f":"LOOKUP(A19,Data!A$21:A$4869,Data!G$21:G$4869)","v":16635840},1525]
[247,19,17565630,{"$f":"LOOKUP(A20,Data!A$21:A$4869,Data!G$21:G$4869)","v":17564352},1278]
[260,20,18493895,{"$f":"LOOKUP(A21,Data!A$21:A$4869,Data!G$21:G$4869)","v":18492864},1031]
[273,21,19422160,{"$f":"LOOKUP(A22,Data!A$21:A$4869,Data!G$21:G$4869)","v":19418958},3202]
[286,22,20350425,{"$f":"LOOKUP(A23,Data!A$21:A$4869,Data!G$21:G$4869)","v":20347470},2955]
[299,23,21278690,{"$f":"LOOKUP(A24,Data!A$21:A$4869,Data!G$21:G$4869)","v":21275982},2708]
[312,24,22206955,{"$f":"LOOKUP(A25,Data!A$21:A$4869,Data!G$21:G$4869)","v":22204494},2461]
[325,25,23135220,{"$f":"LOOKUP(A26,Data!A$21:A$4869,Data!G$21:G$4869)","v":23133006},2214]
[338,26,24063485,{"$f":"LOOKUP(A27,Data!A$21:A$4869,Data!G$21:G$4869)","v":24061518},1967]
[351,27,24991750,{"$f":"LOOKUP(A28,Data!A$21:A$4869,Data!G$21:G$4869)","v":24990030},1720]
[364,28,25920015,{"$f":"LOOKUP(A29,Data!A$21:A$4869,Data!G$21:G$4869)","v":25918542},1473]
[377,29,26848280,{"$f":"LOOKUP(A30,Data!A$21:A$4869,Data!G$21:G$4869)","v":26847054},1226]
[390,30,27776545,{"$f":"LOOKUP(A31,Data!A$21:A$4869,Data!G$21:G$4869)","v":27775566},979]
[403,31,28704810,{"$f":"LOOKUP(A32,Data!A$21:A$4869,Data!G$21:G$4869)","v":28701660},3150]
[416,32,29633075,{"$f":"LOOKUP(A33,Data!A$21:A$4869,Data!G$21:G$4869)","v":29630172},2903]
[429,33,30561340,{"$f":"LOOKUP(A34,Data!A$21:A$4869,Data!G$21:G$4869)","v":30558684},2656]
[442,34,31489605,{"$f":"LOOKUP(A35,Data!A$21:A$4869,Data!G$21:G$4869)","v":31487196},2409]
[455,35,32417870,{"$f":"LOOKUP(A36,Data!A$21:A$4869,Data!G$21:G$4869)","v":32415708},2162]
[468,36,33346135,{"$f":"LOOKUP(A37,Data!A$21:A$4869,Data!G$21:G$4869)","v":33344220},1915]
[481,37,34274400,{"$f":"LOOKUP(A38,Data!A$21:A$4869,Data!G$21:G$4869)","v":34272732},1668]
[494,38,35202665,{"$f":"LOOKUP(A39,Data!A$21:A$4869,Data!G$21:G$4869)","v":35201244},1421]
[507,39,36130930,{"$f":"LOOKUP(A40,Data!A$21:A$4869,Data!G$21:G$4869)","v":36129756},1174]
[520,40,37059195,{"$f":"LOOKUP(A41,Data!A$21:A$4869,Data!G$21:G$4869)","v":37058268},927]
[533,41,37987460,{"$f":"LOOKUP(A42,Data!A$21:A$4869,Data!G$21:G$4869)","v":37984362},3098]
[546,42,38915725,{"$f":"LOOKUP(A43,Data!A$21:A$4869,Data!G$21:G$4869)","v":38912874},2851]
[559,43,39843990,{"$f":"LOOKUP(A44,Data!A$21:A$4869,Data!G$21:G$4869)","v":39841386},2604]
[572,44,40772255,{"$f":"LOOKUP(A45,Data!A$21:A$4869,Data!G$21:G$4869)","v":40769898},2357]
[585,45,41700520,{"$f":"LOOKUP(A46,Data!A$21:A$4869,Data!G$21:G$4869)","v":41698410},2110]
[598,46,42628785,{"$f":"LOOKUP(A47,Data!A$21:A$4869,Data!G$21:G$4869)","v":42626922},1863]
[611,47,43557050,{"$f":"LOOKUP(A48,Data!A$21:A$4869,Data!G$21:G$4869)","v":43555434},1616]
[624,48,44485315,{"$f":"LOOKUP(A49,Data!A$21:A$4869,Data!G$21:G$4869)","v":44483946},1369]
[637,49,45413580,{"$f":"LOOKUP(A50,Data!A$21:A$4869,Data!G$21:G$4869)","v":45412458},1122]
[650,50,46341845,{"$f":"LOOKUP(A51,Data!A$21:A$4869,Data!G$21:G$4869)","v":46338552},3293]
[663,51,47270110,{"$f":"LOOKUP(A52,Data!A$21:A$4869,Data!G$21:G$4869)","v":47267064},3046]
[676,52,48198375,{"$f":"LOOKUP(A53,Data!A$21:A$4869,Data!G$21:G$4869)","v":48195576},2799]
[689,53,49126640,{"$f":"LOOKUP(A54,Data!A$21:A$4869,Data!G$21:G$4869)","v":49124088},2552]
[702,54,50054905,{"$f":"LOOKUP(A55,Data!A$21:A$4869,Data!G$21:G$4869)","v":50052600},2305]
[715,55,50983170,{"$f":"LOOKUP(A56,Data!A$21:A$4869,Data!G$21:G$4869)","v":50981112},2058]
[728,56,51911435,{"$f":"LOOKUP(A57,Data!A$21:A$4869,Data!G$21:G$4869)","v":51909624},1811]
[741,57,52839700,{"$f":"LOOKUP(A58,Data!A$21:A$4869,Data!G$21:G$4869)","v":52838136},1564]
[754,58,53767965,{"$f":"LOOKUP(A59,Data!A$21:A$4869,Data!G$21:G$4869)","v":53766648},1317]
[767,59,54696230,{"$f":"LOOKUP(A60,Data!A$21:A$4869,Data!G$21:G$4869)","v":54695160},1070]
[780,60,55624495,{"$f":"LOOKUP(A61,Data!A$21:A$4869,Data!G$21:G$4869)","v":55621254},3241]
[793,61,56552760,{"$f":"LOOKUP(A62,Data!A$21:A$4869,Data!G$21:G$4869)","v":56549766},2994]
[806,62,57481025,{"$f":"LOOKUP(A63,Data!A$21:A$4869,Data!G$21:G$4869)","v":57478278},2747]
[819,63,58409290,{"$f":"LOOKUP(A64,Data!A$21:A$4869,Data!G$21:G$4869)","v":58406790},2500]
[832,64,59337555,{"$f":"LOOKUP(A65,Data!A$21:A$4869,Data!G$21:G$4869)","v":59335302},2253]
[845,65,60265820,{"$f":"LOOKUP(A66,Data!A$21:A$4869,Data!G$21:G$4869)","v":60263814},{"$f":"C66-D66","v":2006}]
[858,66,{"$f":"(A67-1)*PPM","v":61194085},{"$f":"LOOKUP(A67,Data!A$21:A$4869,Data!G$21:G$4869)","v":61192326},1759]
[{"$f":"A67+13","v":871},{"$f":"B67+1","v":67},62122350,{"$f":"LOOKUP(A68,Data!A$21:A$4869,Data!G$21:G$4869)","v":62120838},1512]
[884,68,63050615,{"$f":"LOOKUP(A69,Data!A$21:A$4869,Data!G$21:G$4869)","v":63049350},1265]
[897,69,63978880,{"$f":"LOOKUP(A70,Data!A$21:A$4869,Data!G$21:G$4869)","v":63977862},1018]
[910,70,64907145,{"$f":"LOOKUP(A71,Data!A$21:A$4869,Data!G$21:G$4869)","v":64903956},3189]
[923,71,65835410,{"$f":"LOOKUP(A72,Data!A$21:A$4869,Data!G$21:G$4869)","v":65832468},2942]
[936,72,66763675,{"$f":"LOOKUP(A73,Data!A$21:A$4869,Data!G$21:G$4869)","v":66760980},2695]
[949,73,67691940,{"$f":"LOOKUP(A74,Data!A$21:A$4869,Data!G$21:G$4869)","v":67689492},2448]
[962,74,68620205,{"$f":"LOOKUP(A75,Data!A$21:A$4869,Data!G$21:G$4869)","v":68618004},2201]
[975,75,69548470,{"$f":"LOOKUP(A76,Data!A$21:A$4869,Data!G$21:G$4869)","v":69546516},1954]
[988,76,70476735,{"$f":"LOOKUP(A77,Data!A$21:A$4869,Data!G$21:G$4869)","v":70475028},1707]
[1001,77,71405000,{"$f":"LOOKUP(A78,Data!A$21:A$4869,Data!G$21:G$4869)","v":71403540},1460]
[1014,78,72333265,{"$f":"LOOKUP(A79,Data!A$21:A$4869,Data!G$21:G$4869)","v":72332052},1213]
[1027,79,73261530,{"$f":"LOOKUP(A80,Data!A$21:A$4869,Data!G$21:G$4869)","v":73260564},966]
{"$rows_left_out":295}
{"sheet":"Years2","index":4,"n_rows":374,"n_cols":5,"rows_kept":374}
["Month in Cycle","Lunar Year","New Year Moment","Elapsed","Difference"]
[{"$f":"StartMonth2","v":2},1,{"$f":"(A2-1)*PPM","v":71405},{"$f":"LOOKUP(A2,Data!A$21:A$4869,Data!G$21:G$4869)","v":72540},{"$f":"C2-D2","v":-1135}]
[{"$f":"A2+13","v":15},{"$f":"B2+1","v":2},999670,{"$f":"LOOKUP(A3,Data!A$21:A$4869,Data!G$21:G$4869)","v":998634},1036]
[28,3,1927935,{"$f":"LOOKUP(A4,Data!A$21:A$4869,Data!G$21:G$4869)","v":1927146},789]
[41,4,2856200,{"$f":"LOOKUP(A5,Data!A$21:A$4869,Data!G$21:G$4869)","v":2855658},542]
[54,5,3784465,{"$f":"LOOKUP(A6,Data!A$21:A$4869,Data!G$21:G$4869)","v":3784170},295]
[67,6,4712730,{"$f":"LOOKUP(A7,Data!A$21:A$4869,Data!G$21:G$4869)","v":4712682},48]
[80,7,5640995,{"$f":"LOOKUP(A8,Data!A$21:A$4869,Data!G$21:G$4869)","v":5641194},-199]
[93,8,6569260,{"$f":"LOOKUP(A9,Data!A$21:A$4869,Data!G$21:G$4869)","v":6569706},-446]
[106,9,7497525,{"$f":"LOOKUP(A10,Data!A$21:A$4869,Data!G$21:G$4869)","v":7498218},-693]
[119,10,8425790,{"$f":"LOOKUP(A11,Data!A$21:A$4869,Data!G$21:G$4869)","v":8426730},-940]
[132,11,9354055,{"$f":"LOOKUP(A12,Data!A$21:A$4869,Data!G$21:G$4869)","v":9352824},1231]
[145,12,10282320,{"$f":"LOOKUP(A13,Data!A$21:A$4869,Data!G$21:G$4869)","v":10281336},984]
[158,13,11210585,{"$f":"LOOKUP(A14,Data!A$21:A$4869,Data!G$21:G$4869)","v":11209848},737]
[171,14,12138850,{"$f":"LOOKUP(A15,Data!A$21:A$4869,Data!G$21:G$4869)","v":12138360},490]
[184,15,13067115,{"$f":"LOOKUP(A16,Data!A$21:A$4869,Data!G$21:G$4869)","v":13066872},243]
[197,16,13995380,{"$f":"LOOKUP(A17,Data!A$21:A$4869,Data!G$21:G$4869)","v":13995384},-4]
[210,17,14923645,{"$f":"LOOKUP(A18,Data!A$21:A$4869,Data!G$21:G$4869)","v":14923896},-251]
[223,18,15851910,{"$f":"LOOKUP(A19,Data!A$21:A$4869,Data!G$21:G$4869)","v":15852408},-498]
[236,19,16780175,{"$f":"LOOKUP(A20,Data!A$21:A$4869,Data!G$21:G$4869)","v":16780920},-745]
[249,20,17708440,{"$f":"LOOKUP(A21,Data!A$21:A$4869,Data!G$21:G$4869)","v":17709432},-992]
[262,21,18636705,{"$f":"LOOKUP(A22,Data!A$21:A$4869,Data!G$21:G$4869)","v":18635526},1179]
[275,22,19564970,{"$f":"LOOKUP(A23,Data!A$21:A$4869,Data!G$21:G$4869)","v":19564038},932]
[288,23,20493235,{"$f":"LOOKUP(A24,Data!A$21:A$4869,Data!G$21:G$4869)","v":20492550},685]
[301,24,21421500,{"$f":"LOOKUP(A25,Data!A$21:A$4869,Data!G$21:G$4869)","v":21421062},438]
[314,25,22349765,{"$f":"LOOKUP(A26,Data!A$21:A$4869,Data!G$21:G$4869)","v":22349574},191]
[327,26,23278030,{"$f":"LOOKUP(A27,Data!A$21:A$4869,Data!G$21:G$4869)","v":23278086},-56]
[340,27,24206295,{"$f":"LOOKUP(A28,Data!A$21:A$4869,Data!G$21:G$4869)","v":24206598},-303]
[353,28,25134560,{"$f":"LOOKUP(A29,Data!A$21:A$4869,Data!G$21:G$4869)","v":25135110},-550]
[366,29,26062825,{"$f":"LOOKUP(A30,Data!A$21:A$4869,Data!G$21:G$4869)","v":26063622},-797]
[379,30,26991090,{"$f":"LOOKUP(A31,Data!A$21:A$4869,Data!G$21:G$4869)","v":26992134},-1044]
[392,31,27919355,{"$f":"LOOKUP(A32,Data!A$21:A$4869,Data!G$21:G$4869)","v":27918228},1127]
[405,32,28847620,{"$f":"LOOKUP(A33,Data!A$21:A$4869,Data!G$21:G$4869)","v":28846740},880]
[418,33,29775885,{"$f":"LOOKUP(A34,Data!A$21:A$4869,Data!G$21:G$4869)","v":29775252},633]
[431,34,30704150,{"$f":"LOOKUP(A35,Data!A$21:A$4869,Data!G$21:G$4869)","v":30703764},386]
[444,35,31632415,{"$f":"LOOKUP(A36,Data!A$21:A$4869,Data!G$21:G$4869)","v":31632276},139]
[457,36,32560680,{"$f":"LOOKUP(A37,Data!A$21:A$4869,Data!G$21:G$4869)","v":32560788},-108]
[470,37,33488945,{"$f":"LOOKUP(A38,Data!A$21:A$4869,Data!G$21:G$4869)","v":33489300},-355]
[483,38,34417210,{"$f":"LOOKUP(A39,Data!A$21:A$4869,Data!G$21:G$4869)","v":34417812},-602]
[496,39,35345475,{"$f":"LOOKUP(A40,Data!A$21:A$4869,Data!G$21:G$4869)","v":35346324},-849]
[509,40,36273740,{"$f":"LOOKUP(A41,Data!A$21:A$4869,Data!G$21:G$4869)","v":36274836},-1096]
[522,41,37202005,{"$f":"LOOKUP(A42,Data!A$21:A$4869,Data!G$21:G$4869)","v":37200930},1075]
[535,42,38130270,{"$f":"LOOKUP(A43,Data!A$21:A$4869,Data!G$21:G$4869)","v":38129442},828]
[548,43,39058535,{"$f":"LOOKUP(A44,Data!A$21:A$4869,Data!G$21:G$4869)","v":39057954},581]
[561,44,39986800,{"$f":"LOOKUP(A45,Data!A$21:A$4869,Data!G$21:G$4869)","v":39986466},334]
[574,45,40915065,{"$f":"LOOKUP(A46,Data!A$21:A$4869,Data!G$21:G$4869)","v":40914978},87]
[587,46,41843330,{"$f":"LOOKUP(A47,Data!A$21:A$4869,Data!G$21:G$4869)","v":41843490},-160]
[600,47,42771595,{"$f":"LOOKUP(A48,Data!A$21:A$4869,Data!G$21:G$4869)","v":42772002},-407]
[613,48,43699860,{"$f":"LOOKUP(A49,Data!A$21:A$4869,Data!G$21:G$4869)","v":43700514},-654]
[626,49,44628125,{"$f":"LOOKUP(A50,Data!A$21:A$4869,Data!G$21:G$4869)","v":44629026},-901]
[639,50,45556390,{"$f":"LOOKUP(A51,Data!A$21:A$4869,Data!G$21:G$4869)","v":45555120},1270]
[652,51,46484655,{"$f":"LOOKUP(A52,Data!A$21:A$4869,Data!G$21:G$4869)","v":46483632},1023]
[665,52,47412920,{"$f":"LOOKUP(A53,Data!A$21:A$4869,Data!G$21:G$4869)","v":47412144},776]
[678,53,48341185,{"$f":"LOOKUP(A54,Data!A$21:A$4869,Data!G$21:G$4869)","v":48340656},529]
[691,54,49269450,{"$f":"LOOKUP(A55,Data!A$21:A$4869,Data!G$21:G$4869)","v":49269168},282]
[704,55,50197715,{"$f":"LOOKUP(A56,Data!A$21:A$4869,Data!G$21:G$4869)","v":50197680},35]
[717,56,51125980,{"$f":"LOOKUP(A57,Data!A$21:A$4869,Data!G$21:G$4869)","v":51126192},-212]
[730,57,52054245,{"$f":"LOOKUP(A58,Data!A$21:A$4869,Data!G$21:G$4869)","v":52054704},-459]
[743,58,52982510,{"$f":"LOOKUP(A59,Data!A$21:A$4869,Data!G$21:G$4869)","v":52983216},-706]
[756,59,53910775,{"$f":"LOOKUP(A60,Data!A$21:A$4869,Data!G$21:G$4869)","v":53911728},-953]
[769,60,54839040,{"$f":"LOOKUP(A61,Data!A$21:A$4869,Data!G$21:G$4869)","v":54837822},1218]
[782,61,55767305,{"$f":"LOOKUP(A62,Data!A$21:A$4869,Data!G$21:G$4869)","v":55766334},971]
[795,62,56695570,{"$f":"LOOKUP(A63,Data!A$21:A$4869,Data!G$21:G$4869)","v":56694846},724]
[808,63,57623835,{"$f":"LOOKUP(A64,Data!A$21:A$4869,Data!G$21:G$4869)","v":57623358},477]
[821,64,58552100,{"$f":"LOOKUP(A65,Data!A$21:A$4869,Data!G$21:G$4869)","v":58551870},230]
[834,65,{"$f":"(A66-1)*PPM","v":59480365},{"$f":"LOOKUP(A66,Data!A$21:A$4869,Data!G$21:G$4869)","v":59480382},{"$f":"C66-D66","v":-17}]
[{"$f":"A66+13","v":847},{"$f":"B66+1","v":66},60408630,{"$f":"LOOKUP(A67,Data!A$21:A$4869,Data!G$21:G$4869)","v":60408894},-264]
[860,67,61336895,{"$f":"LOOKUP(A68,Data!A$21:A$4869,Data!G$21:G$4869)","v":61337406},-511]
[873,68,62265160,{"$f":"LOOKUP(A69,Data!A$21:A$4869,Data!G$21:G$4869)","v":62265918},-758]
[886,69,63193425,{"$f":"LOOKUP(A70,Data!A$21:A$4869,Data!G$21:G$4869)","v":63194430},-1005]
[899,70,64121690,{"$f":"LOOKUP(A71,Data!A$21:A$4869,Data!G$21:G$4869)","v":64120524},1166]
[912,71,65049955,{"$f":"LOOKUP(A72,Data!A$21:A$4869,Data!G$21:G$4869)","v":65049036},919]
[925,72,65978220,{"$f":"LOOKUP(A73,Data!A$21:A$4869,Data!G$21:G$4869)","v":65977548},672]
[938,73,66906485,{"$f":"LOOKUP(A74,Data!A$21:A$4869,Data!G$21:G$4869)","v":66906060},425]
[951,74,67834750,{"$f":"LOOKUP(A75,Data!A$21:A$4869,Data!G$21:G$4869)","v":67834572},178]
[964,75,68763015,{"$f":"LOOKUP(A76,Data!A$21:A$4869,Data!G$21:G$4869)","v":68763084},-69]
[977,76,69691280,{"$f":"LOOKUP(A77,Data!A$21:A$4869,Data!G$21:G$4869)","v":69691596},-316]
[990,77,70619545,{"$f":"LOOKUP(A78,Data!A$21:A$4869,Data!G$21:G$4869)","v":70620108},-563]
[1003,78,71547810,{"$f":"LOOKUP(A79,Data!A$21:A$4869,Data!G$21:G$4869)","v":71548620},-810]
[1016,79,72476075,{"$f":"LOOKUP(A80,Data!A$21:A$4869,Data!G$21:G$4869)","v":72477132},-1057]
{"$rows_left_out":295}
{"sheet":"Zoom","index":5,"n_rows":11,"n_cols":9,"rows_kept":11}
[0,"= Current Zoom Level"]
["Level","Months","MajorTick","MinorTick","Shift","Connect","Years","YearsMajor","YearsMinor"]
[{"$f":"ROW()-3","v":0},{"$f":"2*MPC","v":4836},186,93,null,false,{"$f":"B3/13","v":372},12,3]
[1,{"$f":"B3/2","v":2418},{"$f":"C3/2","v":93},31,{"$f":"B5","v":1209},false,186,6,3]
[2,{"$f":"B4/2","v":1209},65,13,416,false,93,2,1]
[3,416,13,13,208,false,32,1,1]
[4,208,13,13,104,true,16,1,1]
[5,104,13,1,52,true,8,1,{"$f":"1/13","v":0.07692307692307693}]
[6,{"$f":"B8/2","v":52},1,1,26,true,4,1,{"$f":"1/13","v":0.07692307692307693}]
[7,26,1,1,{"$f":"B11","v":13},true,2,1,{"$f":"1/13","v":0.07692307692307693}]
[8,{"$f":"B10/2","v":13},1,1,13,true,1,1,{"$f":"1/13","v":0.07692307692307693}]

{"sheet":"Labels","index":6,"n_rows":27,"n_cols":3,"rows_kept":27}
["Lunar Year","Hours",{"$f":"\"Span \"&B2-B27&\"h\"","v":"Span 75h"}]
[373,48]
[{"$f":"A2","v":373},{"$f":"B2-3","v":45}]
[{"$f":"A3","v":373},{"$f":"B3-3","v":42}]
[{"$f":"A4","v":373},39]
[{"$f":"A5","v":373},36]
[373,33]
[373,30]
[373,27]
[373,24]
[373,21]
[373,18]
[373,15]
[373,12]
[373,9]
[{"$f":"A15","v":373},{"$f":"B15-3","v":6}]
[373,3]
[373,0]
[373,-3]
[373,-6]
[373,-9]
[373,-12]
[373,-15]
[373,-18]
[373,-21]
[373,-24]
[373,-27]