{"text_format":"3","workbook":"xlsx","n_sheets":6,"sheets":["Chart","Data","Years","Rules","Zoom","Labels"],"not_rendered":{"charts":1,"macros":1,"defined_names":15},"read":"whole","date_system":"1900"}

{"sheet":"Chart","index":0,"n_rows":23,"n_cols":17,"rows_kept":23}
["Lunar Cycle Jitter:  Seventeen-Month Lunar Calendar"]
["http://www.hermetic.ch/cal_stud/palmen/lun17m.htm"]
[{"$f":"\"Cycle contains \"&MPC&\" months (\"&FMPC&\" full, \"&DMPC&\" deficient) = \"&DPC&\" days = \"&reducefraction(DPC,7,FALSE,FALSE,TRUE)&\" weeks.\"","v":"Cycle contains 850 months (451 full, 399 deficient) = 25101 days = 3585+6/7 weeks."}]
["Lunar years have 17 lunar months, odd-numbered months have 30 days,"]
["even-numbered months have 29 days, except 8th month of the 50th year, which has 30 days."]
[{"$f":"\"Mean month = \"&\"29+\"&reducefraction(FMPC,MPC,FALSE,FALSE,TRUE)&\" days = 29d 12h 44m and \"&reducefraction(240*(360*FMPC-191*MPC),MPC,FALSE,FALSE,TRUE)&\" seconds\"","v":"Mean month = 29+451/850 days = 29d 12h 44m and 2+14/17 seconds"}]
[{"$f":"\"or approximately 29\"&MID(FMPC/MPC,2,20)&\" days = 29d 12h 44m and \"&ROUND(240*(360*FMPC-191*MPC)/MPC,6)&\" seconds.\"","v":"or approximately 29.530588235294118 days = 29d 12h 44m and 2.823529 seconds."}]
[{"$f":"\"Duration per ''Part'' = 1/\"&MPC&\" day = \"&reducefraction(24,MPC,FALSE,FALSE,TRUE)&\" hour = \"&reducefraction(1440,MPC,FALSE,FALSE,TRUE)&\" minutes = \"&reducefraction(86400,MPC,FALSE,FALSE,TRUE)&\" seconds;  one hour = \"&reducefraction(MPC,24,FALSE,FALSE,TRUE)&\" parts.\"","v":"Duration per ''Part'' = 1/850 day = 12/425 hour = 1+59/85 minutes = 101+11/17 seconds;  one hour = 35+5/12 parts."}]
[]
[]
[]
[{"$nulls":16},false]
[]
[]
[]
[]
[]
[]
[{"$nulls":16},1]
[{"$nulls":16},"Selected"]
[{"$nulls":16},"Month"]
[{"$nulls":16},"in Year"]
[{"$nulls":16},"(1 to 17)"]

{"sheet":"Data","index":1,"n_rows":1721,"n_cols":8,"rows_kept":1721}
["Lunar Cycle Jitter Evaluator"]
["by Dr. Irv Bromberg, University of Toronto, Canada"]
["http://individual.utoronto.ca/intervalmath/jitter/index.html",null,null,"Jitter","(parts)"]
[{"$nulls":3},{"$f":"MAX(H:H)","v":1232},"maximum",{"$f":"reducefraction(JitterMax*MPC,MPC,FALSE,FALSE,FALSE)","v":"1232"}]
["Months per Cycle (Parts per Day):",850,"months (parts)",{"$f":"MIN(H:H)","v":-399},"minimum",{"$f":"reducefraction(JitterMin*MPC,MPC,FALSE,FALSE,FALSE)","v":"–(399)"}]
["30-day Months per Cycle:",451,"months",{"$f":"D4-D5","v":1631},"range",{"$f":"reducefraction(JitterRange*MPC,MPC,FALSE,FALSE,FALSE)","v":"1631"}]
["29-day Months per Cycle:",{"$f":"MPC-FMPC","v":399},"months",{"$f":"\"Jitter range = \"&F6&\" parts = \"&reducefraction(F6*24,MPC,FALSE,FALSE,FALSE)&\" hours\"","v":"Jitter range = 1631 parts = 46 + 22 / 425 hours"}]
["Days per Cycle (Parts per Month):",{"$f":"29*MPC+FMPC","v":25101},"days (parts)"]
[{"$nulls":3},"Limits for Chart:"]
["Mean Month:",{"$f":"\"29 + \"&reducefraction(FMPC,MPC,FALSE,FALSE,FALSE)","v":"29 + 451 / 850"},"days","x","y","Hours"]
["Mean Month >29d:",{"$f":"FMPC/MPC","v":{"v":0.5305882352941177,"d":"0.530588235294118"}},"days",{"$f":"A21","v":1},{"$f":"JitterMax","v":1232},{"$f":"E11*24/MPC","v":34.78588235294118}]
["Mean Month >29d 12h 44m:",{"$f":"reducefraction(240*(360*FMPC-191*MPC),MPC,FALSE,FALSE,TRUE)","v":"2+14/17"},"seconds",{"$f":"D11+MPC*2","v":1701},{"$f":"E11","v":1232},{"$f":"E12*24/MPC","v":34.78588235294118}]
["… or approximately:",{"$f":"240*(360*FMPC-191*MPC)/MPC","v":2.823529411764706},"seconds"]
[{"$nulls":3},{"$f":"D11","v":1},0]
[{"$nulls":3},{"$f":"D12","v":1701},0]
[]
[{"$nulls":3},{"$f":"A21","v":1},{"$f":"JitterMin","v":-399},{"$f":"E17*24/MPC","v":-11.265882352941176}]
["Duration per Part:",{"$f":"reducefraction(1440,MPC,FALSE,FALSE,FALSE)","v":"1 + 59 / 85"},"minutes",{"$f":"D12","v":1701},{"$f":"E17","v":-399},{"$f":"E18*24/MPC","v":-11.265882352941176}]
[]
["Month in Cycle","Lunar Year","Month in Year","Leap Month?","Month Length","New Month Moment","Elapsed","Difference"]
[1,1,1,{"$f":"AND(MOD(B21,50)=0,C21=8)","v":false},{"$f":"IF(MOD(C21,2)=1,30,29)+IF(D21,1,0)","v":30},0,0,{"$f":"F21-G21","v":0}]
[{"$f":"A21+1","v":2},{"$f":"IF(C22=1,B21+1,B21)","v":1},{"$f":"IF(C21=17,1,C21+1)","v":2},{"$f":"AND(MOD(B22,50)=0,C22=8)","v":false},{"$f":"IF(MOD(C22,2)=1,30,29)+IF(D22,1,0)","v":29},{"$f":"F21+PPM","v":25101},{"$f":"G21+E21*PPD","v":25500},-399]
[{"$f":"A22+1","v":3},1,{"$f":"IF(C22=17,1,C22+1)","v":3},false,30,{"$f":"F22+PPM","v":50202},50150,52]
[4,1,4,false,29,75303,75650,-347]
[5,1,5,false,30,100404,100300,104]
[6,1,6,false,29,125505,125800,-295]
[7,1,7,false,30,150606,150450,156]
[8,1,8,false,29,175707,175950,-243]
[9,1,9,false,30,200808,200600,208]
[10,1,10,false,29,225909,226100,-191]
[11,1,11,false,30,251010,250750,260]
[12,1,12,false,29,276111,276250,-139]
[13,1,13,false,30,301212,300900,312]
[14,1,14,false,29,326313,326400,-87]
[15,1,15,false,30,351414,351050,364]
[16,1,16,false,29,376515,376550,-35]
[17,1,17,false,30,401616,401200,416]
[18,2,1,false,30,426717,426700,17]
[19,2,2,false,29,451818,452200,-382]
[20,2,3,false,30,476919,476850,69]
[21,2,4,false,29,502020,502350,-330]
[22,2,5,false,30,527121,527000,121]
[23,2,6,false,29,552222,552500,-278]
[24,2,7,false,30,577323,577150,173]
[25,2,8,false,29,602424,602650,-226]
[26,2,9,false,30,627525,627300,225]
[27,2,10,false,29,652626,652800,-174]
[28,2,11,false,30,677727,677450,277]
[29,2,12,false,29,702828,702950,-122]
[30,2,13,false,30,727929,727600,329]
[31,2,14,false,29,753030,753100,-70]
[32,2,15,false,30,778131,777750,381]
[33,2,16,false,29,803232,803250,-18]
[34,2,17,false,30,828333,827900,433]
[35,3,1,false,30,853434,853400,34]
[{"$f":"A55+1","v":36},3,2,false,29,878535,878900,-365]
[37,3,3,false,30,903636,903550,86]
[38,3,4,false,29,928737,929050,-313]
[39,3,5,false,30,953838,953700,138]
[40,3,6,false,29,978939,979200,-261]
[41,3,7,false,30,1004040,1003850,190]
[42,3,8,false,29,1029141,1029350,-209]
[43,3,9,false,30,1054242,1054000,242]
[44,3,10,false,29,1079343,1079500,-157]
[45,3,11,false,30,1104444,1104150,294]
[46,3,12,false,29,1129545,1129650,-105]
[47,3,13,false,30,1154646,1154300,346]
[48,3,14,false,29,1179747,1179800,-53]
[49,3,15,false,30,1204848,1204450,398]
[50,3,16,false,29,1229949,1229950,-1]
[51,3,17,false,30,1255050,1254600,450]
[52,4,1,false,30,1280151,1280100,51]
[53,4,2,false,29,1305252,1305600,-348]
[54,4,3,false,30,1330353,1330250,103]
[55,4,4,false,29,1355454,1355750,-296]
[56,4,5,false,30,1380555,1380400,155]
[57,4,6,false,29,1405656,1405900,-244]
[58,4,7,false,30,1430757,1430550,207]
[59,4,8,false,29,1455858,1456050,-192]
[60,4,9,false,30,1480959,1480700,259]
[61,4,10,false,29,1506060,1506200,-140]
[62,4,11,false,30,1531161,1530850,311]
[63,4,12,false,29,1556262,1556350,-88]
[64,4,13,false,30,1581363,1581000,363]
[65,4,14,false,29,1606464,1606500,{"$f":"F85-G85","v":-36}]
[66,{"$f":"IF(C86=1,B85+1,B85)","v":4},15,{"$f":"AND(MOD(B86,50)=0,C86=8)","v":false},{"$f":"IF(MOD(C86,2)=1,30,29)+IF(D86,1,0)","v":30},1631565,{"$f":"G85+E85*PPD","v":1631150},415]
[67,4,{"$f":"IF(C86=17,1,C86+1)","v":16},false,29,{"$f":"F86+PPM","v":1656666},1656650,16]
[68,4,17,false,30,1681767,1681300,467]
[69,5,1,false,30,1706868,1706800,68]
[70,5,2,false,29,1731969,1732300,-331]
[71,5,3,false,30,1757070,1756950,120]
[72,5,4,false,29,1782171,1782450,-279]
[73,5,5,false,30,1807272,1807100,172]
[74,5,6,false,29,1832373,1832600,-227]
[75,5,7,false,30,1857474,1857250,224]
[76,5,8,false,29,1882575,1882750,-175]
[77,5,9,false,30,1907676,1907400,276]
[78,5,10,false,29,1932777,1932900,-123]
[79,5,11,false,30,1957878,1957550,328]
[80,5,12,false,29,1982979,1983050,-71]
[81,5,13,false,30,2008080,2007700,380]
[82,5,14,false,29,2033181,2033200,-19]
[83,5,15,false,30,2058282,2057850,432]
[84,5,16,false,29,2083383,2083350,33]
[85,5,17,false,30,2108484,2108000,484]
[86,6,1,false,30,2133585,2133500,85]
[87,6,2,false,29,2158686,2159000,-314]
[88,6,3,false,30,2183787,2183650,137]
[89,6,4,false,29,2208888,2209150,-262]
[90,6,5,false,30,2233989,2233800,189]
[91,6,6,false,29,2259090,2259300,-210]
[92,6,7,false,30,2284191,2283950,241]
[93,6,8,false,29,2309292,2309450,-158]
[94,6,9,false,30,2334393,2334100,293]
[95,6,10,false,29,2359494,2359600,-106]
[96,6,11,false,30,2384595,2384250,345]
[97,6,12,false,29,2409696,2409750,-54]
[98,6,13,false,30,2434797,2434400,397]
[99,6,14,false,29,2459898,2459900,-2]
[{"$f":"A119+1","v":100},6,15,false,30,2484999,2484550,449]
[101,6,16,false,29,2510100,2510050,50]
[102,6,17,false,30,2535201,2534700,501]
[103,7,1,false,30,2560302,2560200,102]
[104,7,2,false,29,2585403,2585700,-297]
[105,7,3,false,30,2610504,2610350,154]
[106,7,4,false,29,2635605,2635850,-245]
[107,7,5,false,30,2660706,2660500,206]
[108,7,6,false,29,2685807,2686000,-193]
[109,7,7,false,30,2710908,2710650,258]
[110,7,8,false,29,2736009,2736150,-141]
[111,7,9,false,30,2761110,2760800,310]
[112,7,10,false,29,2786211,2786300,-89]
[113,7,11,false,30,2811312,2810950,362]
[114,7,12,false,29,2836413,2836450,-37]
[115,7,13,false,30,2861514,2861100,414]
[116,7,14,false,29,2886615,2886600,15]
[117,7,15,false,30,2911716,2911250,466]
[118,7,16,false,29,2936817,2936750,67]
[119,7,17,false,30,2961918,2961400,518]
[120,8,1,false,30,2987019,2986900,119]
[121,8,2,false,29,3012120,3012400,-280]
[122,8,3,false,30,3037221,3037050,171]
[123,8,4,false,29,3062322,3062550,-228]
[124,8,5,false,30,3087423,3087200,223]
[125,8,6,false,29,3112524,3112700,-176]
[126,8,7,false,30,3137625,3137350,275]
[127,8,8,false,29,3162726,3162850,-124]
[128,8,9,false,30,3187827,3187500,327]
[129,8,10,false,29,3212928,3213000,{"$f":"F149-G149","v":-72}]
[130,{"$f":"IF(C150=1,B149+1,B149)","v":8},11,{"$f":"AND(MOD(B150,50)=0,C150=8)","v":false},{"$f":"IF(MOD(C150,2)=1,30,29)+IF(D150,1,0)","v":30},3238029,{"$f":"G149+E149*PPD","v":3237650},379]
[131,8,{"$f":"IF(C150=17,1,C150+1)","v":12},false,29,{"$f":"F150+PPM","v":3263130},3263150,-20]
[132,8,13,false,30,3288231,3287800,431]
[133,8,14,false,29,3313332,3313300,32]
[134,8,15,false,30,3338433,3337950,483]
[135,8,16,false,29,3363534,3363450,84]
[136,8,17,false,30,3388635,3388100,535]
[137,9,1,false,30,3413736,3413600,136]
[138,9,2,false,29,3438837,3439100,-263]
[139,9,3,false,30,3463938,3463750,188]
[140,9,4,false,29,3489039,3489250,-211]
[141,9,5,false,30,3514140,3513900,240]
[142,9,6,false,29,3539241,3539400,-159]
[143,9,7,false,30,3564342,3564050,292]
[144,9,8,false,29,3589443,3589550,-107]
[145,9,9,false,30,3614544,3614200,344]
[146,9,10,false,29,3639645,3639700,-55]
[147,9,11,false,30,3664746,3664350,396]
[148,9,12,false,29,3689847,3689850,-3]
[149,9,13,false,30,3714948,3714500,448]
[150,9,14,false,29,3740049,3740000,49]
[151,9,15,false,30,3765150,3764650,500]
[152,9,16,false,29,3790251,3790150,101]
[153,9,17,false,30,3815352,3814800,552]
[154,10,1,false,30,3840453,3840300,153]
[155,10,2,false,29,3865554,3865800,-246]
[156,10,3,false,30,3890655,3890450,205]
[157,10,4,false,29,3915756,3915950,-194]
[158,10,5,false,30,3940857,3940600,257]
[159,10,6,false,29,3965958,3966100,-142]
[160,10,7,false,30,3991059,3990750,309]
[161,10,8,false,29,4016160,4016250,-90]
[162,10,9,false,30,4041261,4040900,361]
[163,10,10,false,29,4066362,4066400,-38]
[{"$f":"A183+1","v":164},10,11,false,30,4091463,4091050,413]
[165,10,12,false,29,4116564,4116550,14]
[166,10,13,false,30,4141665,4141200,465]
[167,10,14,false,29,4166766,4166700,66]
[168,10,15,false,30,4191867,4191350,517]
[169,10,16,false,29,4216968,4216850,118]
[170,10,17,false,30,4242069,4241500,569]
[171,11,1,false,30,4267170,4267000,170]
[172,11,2,false,29,4292271,4292500,-229]
[173,11,3,false,30,4317372,4317150,222]
[174,11,4,false,29,4342473,4342650,-177]
[175,11,5,false,30,4367574,4367300,274]
[176,11,6,false,29,4392675,4392800,-125]
[177,11,7,false,30,4417776,4417450,326]
[178,11,8,false,29,4442877,4442950,-73]
[179,11,9,false,30,4467978,4467600,378]
[180,11,10,false,29,4493079,4493100,-21]
{"$rows_left_out":1522}
{"sheet":"Years","index":2,"n_rows":101,"n_cols":5,"rows_kept":101}
["Month in Cycle","Lunar Year","New Year Moment","Elapsed","Difference"]
[{"$f":"StartMonth","v":1},{"$f":"IF(StartMonth>=9,2,1)","v":1},{"$f":"(A2-1)*PPM","v":0},{"$f":"LOOKUP(A2,Data!A$21:A$1721,Data!G$21:G$1721)","v":0},{"$f":"C2-D2","v":0}]
[{"$f":"A2+17","v":18},{"$f":"B2+1","v":2},{"$f":"(A3-1)*PPM","v":426717},{"$f":"LOOKUP(A3,Data!A$21:A$1721,Data!G$21:G$1721)","v":426700},{"$f":"C3-D3","v":17}]
[{"$f":"A3+17","v":35},{"$f":"B3+1","v":3},853434,{"$f":"LOOKUP(A4,Data!A$21:A$1721,Data!G$21:G$1721)","v":853400},34]
[52,4,1280151,{"$f":"LOOKUP(A5,Data!A$21:A$1721,Data!G$21:G$1721)","v":1280100},51]
[69,5,1706868,{"$f":"LOOKUP(A6,Data!A$21:A$1721,Data!G$21:G$1721)","v":1706800},68]
[86,6,2133585,{"$f":"LOOKUP(A7,Data!A$21:A$1721,Data!G$21:G$1721)","v":2133500},85]
[103,7,2560302,{"$f":"LOOKUP(A8,Data!A$21:A$1721,Data!G$21:G$1721)","v":2560200},102]
[120,8,2987019,{"$f":"LOOKUP(A9,Data!A$21:A$1721,Data!G$21:G$1721)","v":2986900},119]
[137,9,3413736,{"$f":"LOOKUP(A10,Data!A$21:A$1721,Data!G$21:G$1721)","v":3413600},136]
[154,10,3840453,{"$f":"LOOKUP(A11,Data!A$21:A$1721,Data!G$21:G$1721)","v":3840300},153]
[171,11,4267170,{"$f":"LOOKUP(A12,Data!A$21:A$1721,Data!G$21:G$1721)","v":4267000},170]
[188,12,4693887,{"$f":"LOOKUP(A13,Data!A$21:A$1721,Data!G$21:G$1721)","v":4693700},187]
[205,13,5120604,{"$f":"LOOKUP(A14,Data!A$21:A$1721,Data!G$21:G$1721)","v":5120400},204]
[222,14,5547321,{"$f":"LOOKUP(A15,Data!A$21:A$1721,Data!G$21:G$1721)","v":5547100},221]
[239,15,5974038,{"$f":"LOOKUP(A16,Data!A$21:A$1721,Data!G$21:G$1721)","v":5973800},238]
[256,16,6400755,{"$f":"LOOKUP(A17,Data!A$21:A$1721,Data!G$21:G$1721)","v":6400500},255]
[273,17,6827472,{"$f":"LOOKUP(A18,Data!A$21:A$1721,Data!G$21:G$1721)","v":6827200},272]
[290,18,7254189,{"$f":"LOOKUP(A19,Data!A$21:A$1721,Data!G$21:G$1721)","v":7253900},289]
[307,19,7680906,{"$f":"LOOKUP(A20,Data!A$21:A$1721,Data!G$21:G$1721)","v":7680600},306]
[324,20,8107623,{"$f":"LOOKUP(A21,Data!A$21:A$1721,Data!G$21:G$1721)","v":8107300},323]
[341,21,8534340,{"$f":"LOOKUP(A22,Data!A$21:A$1721,Data!G$21:G$1721)","v":8534000},340]
[358,22,8961057,{"$f":"LOOKUP(A23,Data!A$21:A$1721,Data!G$21:G$1721)","v":8960700},357]
[375,23,9387774,{"$f":"LOOKUP(A24,Data!A$21:A$1721,Data!G$21:G$1721)","v":9387400},374]
[392,24,9814491,{"$f":"LOOKUP(A25,Data!A$21:A$1721,Data!G$21:G$1721)","v":9814100},391]
[409,25,10241208,{"$f":"LOOKUP(A26,Data!A$21:A$1721,Data!G$21:G$1721)","v":10240800},408]
[426,26,10667925,{"$f":"LOOKUP(A27,Data!A$21:A$1721,Data!G$21:G$1721)","v":10667500},425]
[443,27,11094642,{"$f":"LOOKUP(A28,Data!A$21:A$1721,Data!G$21:G$1721)","v":11094200},442]
[460,28,11521359,{"$f":"LOOKUP(A29,Data!A$21:A$1721,Data!G$21:G$1721)","v":11520900},459]
[477,29,11948076,{"$f":"LOOKUP(A30,Data!A$21:A$1721,Data!G$21:G$1721)","v":11947600},476]
[494,30,12374793,{"$f":"LOOKUP(A31,Data!A$21:A$1721,Data!G$21:G$1721)","v":12374300},493]
[511,31,12801510,{"$f":"LOOKUP(A32,Data!A$21:A$1721,Data!G$21:G$1721)","v":12801000},510]
[528,32,13228227,{"$f":"LOOKUP(A33,Data!A$21:A$1721,Data!G$21:G$1721)","v":13227700},527]
[545,33,13654944,{"$f":"LOOKUP(A34,Data!A$21:A$1721,Data!G$21:G$1721)","v":13654400},544]
[562,34,14081661,{"$f":"LOOKUP(A35,Data!A$21:A$1721,Data!G$21:G$1721)","v":14081100},561]
[579,35,14508378,{"$f":"LOOKUP(A36,Data!A$21:A$1721,Data!G$21:G$1721)","v":14507800},578]
[596,36,14935095,{"$f":"LOOKUP(A37,Data!A$21:A$1721,Data!G$21:G$1721)","v":14934500},595]
[613,37,15361812,{"$f":"LOOKUP(A38,Data!A$21:A$1721,Data!G$21:G$1721)","v":15361200},612]
[630,38,15788529,{"$f":"LOOKUP(A39,Data!A$21:A$1721,Data!G$21:G$1721)","v":15787900},629]
[647,39,16215246,{"$f":"LOOKUP(A40,Data!A$21:A$1721,Data!G$21:G$1721)","v":16214600},646]
[664,40,16641963,{"$f":"LOOKUP(A41,Data!A$21:A$1721,Data!G$21:G$1721)","v":16641300},663]
[681,41,17068680,{"$f":"LOOKUP(A42,Data!A$21:A$1721,Data!G$21:G$1721)","v":17068000},680]
[698,42,17495397,{"$f":"LOOKUP(A43,Data!A$21:A$1721,Data!G$21:G$1721)","v":17494700},697]
[715,43,17922114,{"$f":"LOOKUP(A44,Data!A$21:A$1721,Data!G$21:G$1721)","v":17921400},714]
[732,44,18348831,{"$f":"LOOKUP(A45,Data!A$21:A$1721,Data!G$21:G$1721)","v":18348100},731]
[749,45,18775548,{"$f":"LOOKUP(A46,Data!A$21:A$1721,Data!G$21:G$1721)","v":18774800},748]
[766,46,19202265,{"$f":"LOOKUP(A47,Data!A$21:A$1721,Data!G$21:G$1721)","v":19201500},765]
[783,47,19628982,{"$f":"LOOKUP(A48,Data!A$21:A$1721,Data!G$21:G$1721)","v":19628200},782]
[800,48,20055699,{"$f":"LOOKUP(A49,Data!A$21:A$1721,Data!G$21:G$1721)","v":20054900},799]
[817,49,20482416,{"$f":"LOOKUP(A50,Data!A$21:A$1721,Data!G$21:G$1721)","v":20481600},816]
[834,50,20909133,{"$f":"LOOKUP(A51,Data!A$21:A$1721,Data!G$21:G$1721)","v":20908300},833]
[851,51,21335850,{"$f":"LOOKUP(A52,Data!A$21:A$1721,Data!G$21:G$1721)","v":21335850},0]
[868,52,21762567,{"$f":"LOOKUP(A53,Data!A$21:A$1721,Data!G$21:G$1721)","v":21762550},17]
[885,53,22189284,{"$f":"LOOKUP(A54,Data!A$21:A$1721,Data!G$21:G$1721)","v":22189250},34]
[902,54,22616001,{"$f":"LOOKUP(A55,Data!A$21:A$1721,Data!G$21:G$1721)","v":22615950},51]
[919,55,23042718,{"$f":"LOOKUP(A56,Data!A$21:A$1721,Data!G$21:G$1721)","v":23042650},68]
[936,56,23469435,{"$f":"LOOKUP(A57,Data!A$21:A$1721,Data!G$21:G$1721)","v":23469350},85]
[953,57,23896152,{"$f":"LOOKUP(A58,Data!A$21:A$1721,Data!G$21:G$1721)","v":23896050},102]
[970,58,24322869,{"$f":"LOOKUP(A59,Data!A$21:A$1721,Data!G$21:G$1721)","v":24322750},119]
[987,59,24749586,{"$f":"LOOKUP(A60,Data!A$21:A$1721,Data!G$21:G$1721)","v":24749450},136]
[1004,60,25176303,{"$f":"LOOKUP(A61,Data!A$21:A$1721,Data!G$21:G$1721)","v":25176150},153]
[1021,61,25603020,{"$f":"LOOKUP(A62,Data!A$21:A$1721,Data!G$21:G$1721)","v":25602850},170]
[1038,62,26029737,{"$f":"LOOKUP(A63,Data!A$21:A$1721,Data!G$21:G$1721)","v":26029550},187]
[1055,63,26456454,{"$f":"LOOKUP(A64,Data!A$21:A$1721,Data!G$21:G$1721)","v":26456250},204]
[1072,64,26883171,{"$f":"LOOKUP(A65,Data!A$21:A$1721,Data!G$21:G$1721)","v":26882950},221]
[1089,65,27309888,{"$f":"LOOKUP(A66,Data!A$21:A$1721,Data!G$21:G$1721)","v":27309650},{"$f":"C66-D66","v":238}]
[1106,66,{"$f":"(A67-1)*PPM","v":27736605},{"$f":"LOOKUP(A67,Data!A$21:A$1721,Data!G$21:G$1721)","v":27736350},255]
[{"$f":"A67+17","v":1123},{"$f":"B67+1","v":67},28163322,{"$f":"LOOKUP(A68,Data!A$21:A$1721,Data!G$21:G$1721)","v":28163050},272]
[1140,68,28590039,{"$f":"LOOKUP(A69,Data!A$21:A$1721,Data!G$21:G$1721)","v":28589750},289]
[1157,69,29016756,{"$f":"LOOKUP(A70,Data!A$21:A$1721,Data!G$21:G$1721)","v":29016450},306]
[1174,70,29443473,{"$f":"LOOKUP(A71,Data!A$21:A$1721,Data!G$21:G$1721)","v":29443150},323]
[1191,71,29870190,{"$f":"LOOKUP(A72,Data!A$21:A$1721,Data!G$21:G$1721)","v":29869850},340]
[1208,72,30296907,{"$f":"LOOKUP(A73,Data!A$21:A$1721,Data!G$21:G$1721)","v":30296550},357]
[1225,73,30723624,{"$f":"LOOKUP(A74,Data!A$21:A$1721,Data!G$21:G$1721)","v":30723250},374]
[1242,74,31150341,{"$f":"LOOKUP(A75,Data!A$21:A$1721,Data!G$21:G$1721)","v":31149950},391]
[1259,75,31577058,{"$f":"LOOKUP(A76,Data!A$21:A$1721,Data!G$21:G$1721)","v":31576650},408]
[1276,76,32003775,{"$f":"LOOKUP(A77,Data!A$21:A$1721,Data!G$21:G$1721)","v":32003350},425]
[1293,77,32430492,{"$f":"LOOKUP(A78,Data!A$21:A$1721,Data!G$21:G$1721)","v":32430050},442]
[1310,78,32857209,{"$f":"LOOKUP(A79,Data!A$21:A$1721,Data!G$21:G$1721)","v":32856750},459]
[1327,79,33283926,{"$f":"LOOKUP(A80,Data!A$21:A$1721,Data!G$21:G$1721)","v":33283450},476]
[1344,80,33710643,{"$f":"LOOKUP(A81,Data!A$21:A$1721,Data!G$21:G$1721)","v":33710150},493]
[1361,81,34137360,{"$f":"LOOKUP(A82,Data!A$21:A$1721,Data!G$21:G$1721)","v":34136850},510]
[1378,82,34564077,{"$f":"LOOKUP(A83,Data!A$21:A$1721,Data!G$21:G$1721)","v":34563550},527]
[1395,83,34990794,{"$f":"LOOKUP(A84,Data!A$21:A$1721,Data!G$21:G$1721)","v":34990250},544]
[1412,84,35417511,{"$f":"LOOKUP(A85,Data!A$21:A$1721,Data!G$21:G$1721)","v":35416950},561]
[1429,85,35844228,{"$f":"LOOKUP(A86,Data!A$21:A$1721,Data!G$21:G$1721)","v":35843650},578]
[1446,86,36270945,{"$f":"LOOKUP(A87,Data!A$21:A$1721,Data!G$21:G$1721)","v":36270350},595]
[1463,87,36697662,{"$f":"LOOKUP(A88,Data!A$21:A$1721,Data!G$21:G$1721)","v":36697050},612]
[1480,88,37124379,{"$f":"LOOKUP(A89,Data!A$21:A$1721,Data!G$21:G$1721)","v":37123750},629]
[1497,89,37551096,{"$f":"LOOKUP(A90,Data!A$21:A$1721,Data!G$21:G$1721)","v":37550450},646]
[1514,90,37977813,{"$f":"LOOKUP(A91,Data!A$21:A$1721,Data!G$21:G$1721)","v":37977150},663]
[1531,91,38404530,{"$f":"LOOKUP(A92,Data!A$21:A$1721,Data!G$21:G$1721)","v":38403850},680]
[1548,92,38831247,{"$f":"LOOKUP(A93,Data!A$21:A$1721,Data!G$21:G$1721)","v":38830550},697]
[1565,93,39257964,{"$f":"LOOKUP(A94,Data!A$21:A$1721,Data!G$21:G$1721)","v":39257250},714]
[1582,94,39684681,{"$f":"LOOKUP(A95,Data!A$21:A$1721,Data!G$21:G$1721)","v":39683950},731]
[1599,95,40111398,{"$f":"LOOKUP(A96,Data!A$21:A$1721,Data!G$21:G$1721)","v":40110650},748]
[1616,96,40538115,{"$f":"LOOKUP(A97,Data!A$21:A$1721,Data!G$21:G$1721)","v":40537350},765]
[1633,97,40964832,{"$f":"LOOKUP(A98,Data!A$21:A$1721,Data!G$21:G$1721)","v":40964050},782]
[1650,98,{"$f":"(A99-1)*PPM","v":41391549},{"$f":"LOOKUP(A99,Data!A$21:A$1721,Data!G$21:G$1721)","v":41390750},{"$f":"C99-D99","v":799}]
[1667,99,41818266,{"$f":"LOOKUP(A100,Data!A$21:A$1721,Data!G$21:G$1721)","v":41817450},816]
[1684,100,42244983,{"$f":"LOOKUP(A101,Data!A$21:A$1721,Data!G$21:G$1721)","v":42244150},833]

{"sheet":"Rules","index":3,"n_rows":5,"n_cols":3,"rows_kept":5}
["odd-numbered months have 30 days, even numbered months have 29 days"]
["lunar year has 17 months (9 full, 8 deficient)"]
["length of common year =",{"$f":"(9*30)+(8*29)","v":502},"days"]
["once every 50 lunar years (850 months) a leap day is added to the eighth month of the leap lunar year"]
["when the year number is divisible by 50"]

{"sheet":"Zoom","index":4,"n_rows":10,"n_cols":9,"rows_kept":10}
[0,"= Current Zoom Level"]
["Level","Months","MajorTick","MinorTick","Shift","Connect","Years","YearsMajor","YearsMinor"]
[{"$f":"ROW()-3","v":0},{"$f":"2*MPC","v":1700},170,17,null,false,{"$f":"B3/17","v":100},5,1]
[1,{"$f":"B3/2","v":850},34,17,{"$f":"B5","v":425},false,{"$f":"B4/17","v":50},2,1]
[2,{"$f":"B4/2","v":425},17,17,340,false,25,1,1]
[3,340,17,17,170,false,20,1,1]
[4,170,17,1,68,true,10,1,{"$f":"1/17","v":0.058823529411764705}]
[5,68,17,1,34,true,4,1,{"$f":"1/17","v":0.058823529411764705}]
[6,34,1,1,17,true,2,1,{"$f":"1/17","v":0.058823529411764705}]
[7,17,1,1,17,true,1,1,{"$f":"1/17","v":0.058823529411764705}]

{"sheet":"Labels","index":5,"n_rows":28,"n_cols":3,"rows_kept":28}
["Lunar Year","Hours",{"$f":"\"Span \"&B2-B28&\"h\"","v":"Span 78h"}]
[101,39]
[{"$f":"A2","v":101},{"$f":"B2-3","v":36}]
[{"$f":"A3","v":101},{"$f":"B3-3","v":33}]
[{"$f":"A4","v":101},{"$f":"B4-3","v":30}]
[{"$f":"A5","v":101},{"$f":"B5-3","v":27}]
[101,24]
[101,21]
[101,18]
[101,15]
[101,12]
[101,9]
[101,6]
[101,3]
[101,0]
[101,-3]
[101,-6]
[101,-9]
[101,-12]
[101,-15]
[101,-18]
[101,-21]
[101,-24]
[101,-27]
[101,-30]
[101,-33]
[101,-36]
[101,-39]