{"text_format":"3","workbook":"xlsx","n_sheets":7,"sheets":["Chart","Data","Years","Years2","Rules","Zoom","Labels"],"not_rendered":{"charts":1,"macros":1,"defined_names":16},"read":"whole","date_system":"1900"}

{"sheet":"Chart","index":0,"n_rows":38,"n_cols":17,"rows_kept":38}
["Lunar Cycle Jitter:  Terence McKenna Goddess Calendar"]
["http://www.fractal-timewave.com/mmgc/mmgc.htm"]
[{"$f":"\"Each lunar cycle contains \"&MPC&\" months (\"&FMPC&\" full, \"&DMPC&\" deficient), \"&DPC&\" days = \"&reducefraction(DPC,7,FALSE,FALSE,TRUE)&\" weeks.\"","v":"Each lunar cycle contains 130 months (69 full, 61 deficient), 3839 days = 548+3/7 weeks."}]
["Lunar years have 13 lunar months, even-numbered months have 29 days,"]
["odd-numbered months have 30 days, except that one day is removed from the last month"]
["of year numbers divisible by 10.  Each calendar cycle contains one lunar cycle = 10 lunar years."]
["Common year FDFDFDFDFDFDF=384 days, skip year FDFDFDFDFDFDD=383 days.\""]
[{"$f":"\"Mean month = \"&\"29+\"&reducefraction(FMPC,MPC,FALSE,FALSE,TRUE)&\" days = 29d 12h 44m \"&reducefraction(240*(360*FMPC-191*MPC),MPC,FALSE,FALSE,TRUE)&\" seconds or about 29\"&MID(FMPC/MPC,2,20)&\" days = 29d 12h 44m \"&ROUND(240*(360*FMPC-191*MPC)/MPC,6)&\" seconds.\"","v":"Mean month = 29+69/130 days = 29d 12h 44m 18+6/13 seconds or about 29.530769230769231 days = 29d 12h 44m 18.461538 seconds."}]
[{"$f":"\"Duration per ''Part'' = 1/\"&MPC&\" day = \"&reducefraction(24,MPC,FALSE,FALSE,TRUE)&\" hour = \"&reducefraction(1440,MPC,FALSE,FALSE,TRUE)&\" minutes = \"&reducefraction(86400,MPC,FALSE,FALSE,TRUE)&\" seconds;  one hour = \"&reducefraction(MPC,24,FALSE,FALSE,TRUE)&\" parts.\"","v":"Duration per ''Part'' = 1/130 day = 12/65 hour = 11+1/13 minutes = 664+8/13 seconds;  one hour = 5+5/12 parts."}]
[]
[]
[]
[{"$nulls":16},false]
{"$rows_empty":8}
[{"$nulls":16},13]
[{"$nulls":16},"Selected"]
[{"$nulls":16},"Month"]
[{"$nulls":16},"in Year"]
[{"$nulls":16},"(1 to 13)"]
{"$rows_empty":7}
[{"$nulls":16},2]
[{"$nulls":16},"Selected"]
[{"$nulls":16},"Month"]
[{"$nulls":16},"in Year"]
[{"$nulls":16},"(1 to 13)"]

{"sheet":"Data","index":1,"n_rows":293,"n_cols":8,"rows_kept":293}
["Lunar Cycle Jitter Evaluator"]
["by Dr. Irv Bromberg, University of Toronto, Canada"]
["http://individual.utoronto.ca/intervalmath/jitter/index.html",null,null,"Jitter","(parts)"]
[{"$nulls":3},{"$f":"MAX(H:H)","v":48},"maximum",{"$f":"reducefraction(JitterMax*MPC,MPC,FALSE,FALSE,FALSE)","v":"48"}]
["Months per Cycle (Parts per Day):",{"$f":"10*13","v":130},"months (parts)",{"$f":"MIN(H:H)","v":-178},"minimum",{"$f":"reducefraction(JitterMin*MPC,MPC,FALSE,FALSE,FALSE)","v":"–(178)"}]
["30-day Months per Cycle:",{"$f":"7*10-1","v":69},"months",{"$f":"D4-D5","v":226},"range",{"$f":"reducefraction(JitterRange*MPC,MPC,FALSE,FALSE,FALSE)","v":"226"}]
["29-day Months per Cycle:",{"$f":"MPC-FMPC","v":61},"months",{"$f":"\"Jitter range = \"&F6&\" parts = \"&reducefraction(F6*24,MPC,FALSE,FALSE,FALSE)&\" hours\"","v":"Jitter range = 226 parts = 41 + 47 / 65 hours"}]
["Days per Cycle (Parts per Month):",{"$f":"29*MPC+FMPC","v":3839},"days (parts)"]
["Yerms per Cycle:",{"$f":"2*DPC-59*MPC","v":8},"yerms","Limits for Chart:"]
["Mean Month:",{"$f":"\"29 + \"&reducefraction(FMPC,MPC,FALSE,FALSE,FALSE)","v":"29 + 69 / 130"},"days","x","y","Hours"]
["Mean Month >29d:",{"$f":"FMPC/MPC","v":{"v":0.5307692307692308,"d":"0.530769230769231"}},"days",{"$f":"A21","v":1},{"$f":"JitterMax","v":48},{"$f":"E11*24/MPC","v":8.861538461538462}]
["Mean Month >29d 12h 44m:",{"$f":"reducefraction(240*(360*FMPC-191*MPC),MPC,FALSE,FALSE,TRUE)","v":"18+6/13"},"seconds",{"$f":"D11+MPC*2","v":261},{"$f":"E11","v":48},{"$f":"E12*24/MPC","v":8.861538461538462}]
["… or approximately:",{"$f":"240*(360*FMPC-191*MPC)/MPC","v":18.46153846153846},"seconds"]
[{"$nulls":3},{"$f":"D11","v":1},0]
[{"$nulls":3},{"$f":"D12","v":261},0]
[]
[{"$nulls":3},{"$f":"A21","v":1},{"$f":"JitterMin","v":-178},{"$f":"E17*24/MPC","v":-32.86153846153846}]
["Duration per Part:",{"$f":"reducefraction(1440,MPC,FALSE,FALSE,FALSE)","v":"11 + 1 / 13"},"minutes",{"$f":"D12","v":261},{"$f":"E17","v":-178},{"$f":"E18*24/MPC","v":-32.86153846153846}]
[]
["Month in Cycle","Lunar Year","Month in Year","Short Month?","Month Length","New Month Moment","Elapsed","Difference"]
[1,1,1,{"$f":"AND(MOD(B21,10)<>0,C21=13)","v":false},{"$f":"IF(MOD(C21,2)=1,30,29)-IF(D21,1,0)","v":30},0,0,{"$f":"F21-G21","v":0}]
[{"$f":"A21+1","v":2},{"$f":"IF(C22=1,B21+1,B21)","v":1},{"$f":"IF(C21=13,1,C21+1)","v":2},{"$f":"AND(MOD(B22,10)=0,C22=13)","v":false},{"$f":"IF(MOD(C22,2)=1,30,29)-IF(D22,1,0)","v":29},{"$f":"F21+PPM","v":3839},{"$f":"G21+E21*PPD","v":3900},-61]
[{"$f":"A22+1","v":3},1,{"$f":"IF(C22=13,1,C22+1)","v":3},false,30,{"$f":"F22+PPM","v":7678},7670,8]
[4,1,4,false,29,11517,11570,-53]
[5,1,5,false,30,15356,15340,16]
[6,1,6,false,29,19195,19240,-45]
[7,1,7,false,30,23034,23010,24]
[8,1,8,false,29,26873,26910,-37]
[9,1,9,false,30,30712,30680,32]
[10,1,10,false,29,34551,34580,-29]
[11,1,11,false,30,38390,38350,40]
[12,1,12,false,29,42229,42250,-21]
[13,1,13,false,30,46068,46020,48]
[14,2,1,false,30,49907,49920,-13]
[15,2,2,false,29,53746,53820,-74]
[16,2,3,false,30,57585,57590,-5]
[17,2,4,false,29,61424,61490,-66]
[18,2,5,false,30,65263,65260,3]
[19,2,6,false,29,69102,69160,-58]
[20,2,7,false,30,72941,72930,11]
[21,2,8,false,29,76780,76830,-50]
[22,2,9,false,30,80619,80600,19]
[23,2,10,false,29,84458,84500,-42]
[24,2,11,false,30,88297,88270,27]
[25,2,12,false,29,92136,92170,-34]
[26,2,13,false,30,95975,95940,35]
[27,3,1,false,30,99814,99840,-26]
[28,3,2,false,29,103653,103740,-87]
[29,3,3,false,30,107492,107510,-18]
[30,3,4,false,29,111331,111410,-79]
[31,3,5,false,30,115170,115180,-10]
[32,3,6,false,29,119009,119080,-71]
[33,3,7,false,30,122848,122850,-2]
[34,3,8,false,29,126687,126750,-63]
[35,3,9,false,30,130526,130520,6]
[{"$f":"A55+1","v":36},3,10,false,29,134365,134420,-55]
[37,3,11,false,30,138204,138190,14]
[38,3,12,false,29,142043,142090,-47]
[39,3,13,false,30,145882,145860,22]
[40,4,1,false,30,149721,149760,-39]
[41,4,2,false,29,153560,153660,-100]
[42,4,3,false,30,157399,157430,-31]
[43,4,4,false,29,161238,161330,-92]
[44,4,5,false,30,165077,165100,-23]
[45,4,6,false,29,168916,169000,-84]
[46,4,7,false,30,172755,172770,-15]
[47,4,8,false,29,176594,176670,-76]
[48,4,9,false,30,180433,180440,-7]
[49,4,10,false,29,184272,184340,-68]
[50,4,11,false,30,188111,188110,1]
[51,4,12,false,29,191950,192010,-60]
[52,4,13,false,30,195789,195780,9]
[53,5,1,false,30,199628,199680,-52]
[54,5,2,false,29,203467,203580,-113]
[55,5,3,false,30,207306,207350,-44]
[56,5,4,false,29,211145,211250,-105]
[57,5,5,false,30,214984,215020,-36]
[58,5,6,false,29,218823,218920,-97]
[59,5,7,false,30,222662,222690,-28]
[60,5,8,false,29,226501,226590,-89]
[61,5,9,false,30,230340,230360,-20]
[62,5,10,false,29,234179,234260,-81]
[63,5,11,false,30,238018,238030,-12]
[64,5,12,false,29,241857,241930,-73]
[65,5,13,false,30,245696,245700,{"$f":"F85-G85","v":-4}]
[66,{"$f":"IF(C86=1,B85+1,B85)","v":6},1,{"$f":"AND(MOD(B86,10)=0,C86=13)","v":false},{"$f":"IF(MOD(C86,2)=1,30,29)-IF(D86,1,0)","v":30},249535,{"$f":"G85+E85*PPD","v":249600},-65]
[67,6,{"$f":"IF(C86=13,1,C86+1)","v":2},false,29,{"$f":"F86+PPM","v":253374},253500,-126]
[68,6,3,false,30,257213,257270,-57]
[69,6,4,false,29,261052,261170,-118]
[70,6,5,false,30,264891,264940,-49]
[71,6,6,false,29,268730,268840,-110]
[72,6,7,false,30,272569,272610,-41]
[73,6,8,false,29,276408,276510,-102]
[74,6,9,false,30,280247,280280,-33]
[75,6,10,false,29,284086,284180,-94]
[76,6,11,false,30,287925,287950,-25]
[77,6,12,false,29,291764,291850,-86]
[78,6,13,false,30,295603,295620,-17]
[79,7,1,false,30,299442,299520,-78]
[80,7,2,false,29,303281,303420,-139]
[81,7,3,false,30,307120,307190,-70]
[82,7,4,false,29,310959,311090,-131]
[83,7,5,false,30,314798,314860,-62]
[84,7,6,false,29,318637,318760,-123]
[85,7,7,false,30,322476,322530,-54]
[86,7,8,false,29,326315,326430,-115]
[87,7,9,false,30,330154,330200,-46]
[88,7,10,false,29,333993,334100,-107]
[89,7,11,false,30,337832,337870,-38]
[90,7,12,false,29,341671,341770,-99]
[91,7,13,false,30,345510,345540,-30]
[92,8,1,false,30,349349,349440,-91]
[93,8,2,false,29,353188,353340,-152]
[94,8,3,false,30,357027,357110,-83]
[95,8,4,false,29,360866,361010,-144]
[96,8,5,false,30,364705,364780,-75]
[97,8,6,false,29,368544,368680,-136]
[98,8,7,false,30,372383,372450,-67]
[99,8,8,false,29,376222,376350,-128]
[{"$f":"A119+1","v":100},8,9,false,30,380061,380120,-59]
[101,8,10,false,29,383900,384020,-120]
[102,8,11,false,30,387739,387790,-51]
[103,8,12,false,29,391578,391690,-112]
[104,8,13,false,30,395417,395460,-43]
[105,9,1,false,30,399256,399360,-104]
[106,9,2,false,29,403095,403260,-165]
[107,9,3,false,30,406934,407030,-96]
[108,9,4,false,29,410773,410930,-157]
[109,9,5,false,30,414612,414700,-88]
[110,9,6,false,29,418451,418600,-149]
[111,9,7,false,30,422290,422370,-80]
[112,9,8,false,29,426129,426270,-141]
[113,9,9,false,30,429968,430040,-72]
[114,9,10,false,29,433807,433940,-133]
[115,9,11,false,30,437646,437710,-64]
[116,9,12,false,29,441485,441610,-125]
[117,9,13,false,30,445324,445380,-56]
[118,10,1,false,30,449163,449280,-117]
[119,10,2,false,29,453002,453180,-178]
[120,10,3,false,30,456841,456950,-109]
[121,10,4,false,29,460680,460850,-170]
[122,10,5,false,30,464519,464620,-101]
[123,10,6,false,29,468358,468520,-162]
[124,10,7,false,30,472197,472290,-93]
[125,10,8,false,29,476036,476190,-154]
[126,10,9,false,30,479875,479960,-85]
[127,10,10,false,29,483714,483860,-146]
[128,10,11,false,30,487553,487630,-77]
[129,10,12,false,29,491392,491530,{"$f":"F149-G149","v":-138}]
[130,{"$f":"IF(C150=1,B149+1,B149)","v":10},13,{"$f":"AND(MOD(B150,10)=0,C150=13)","v":true},{"$f":"IF(MOD(C150,2)=1,30,29)-IF(D150,1,0)","v":29},495231,{"$f":"G149+E149*PPD","v":495300},-69]
[131,11,{"$f":"IF(C150=13,1,C150+1)","v":1},false,30,{"$f":"F150+PPM","v":499070},499070,0]
[132,11,2,false,29,502909,502970,-61]
[133,11,3,false,30,506748,506740,8]
[134,11,4,false,29,510587,510640,-53]
[135,11,5,false,30,514426,514410,16]
[136,11,6,false,29,518265,518310,-45]
[137,11,7,false,30,522104,522080,24]
[138,11,8,false,29,525943,525980,-37]
[139,11,9,false,30,529782,529750,32]
[140,11,10,false,29,533621,533650,-29]
[141,11,11,false,30,537460,537420,40]
[142,11,12,false,29,541299,541320,-21]
[143,11,13,false,30,545138,545090,48]
[144,12,1,false,30,548977,548990,-13]
[145,12,2,false,29,552816,552890,-74]
[146,12,3,false,30,556655,556660,-5]
[147,12,4,false,29,560494,560560,-66]
[148,12,5,false,30,564333,564330,3]
[149,12,6,false,29,568172,568230,-58]
[150,12,7,false,30,572011,572000,11]
[151,12,8,false,29,575850,575900,-50]
[152,12,9,false,30,579689,579670,19]
[153,12,10,false,29,583528,583570,-42]
[154,12,11,false,30,587367,587340,27]
[155,12,12,false,29,591206,591240,-34]
[156,12,13,false,30,595045,595010,35]
[157,13,1,false,30,598884,598910,-26]
[158,13,2,false,29,602723,602810,-87]
[159,13,3,false,30,606562,606580,-18]
[160,13,4,false,29,610401,610480,-79]
[161,13,5,false,30,614240,614250,-10]
[162,13,6,false,29,618079,618150,-71]
[163,13,7,false,30,621918,621920,-2]
[{"$f":"A183+1","v":164},13,8,false,29,625757,625820,-63]
[165,13,9,false,30,629596,629590,6]
[166,13,10,false,29,633435,633490,-55]
[167,13,11,false,30,637274,637260,14]
[168,13,12,false,29,641113,641160,-47]
[169,13,13,false,30,644952,644930,22]
[170,14,1,false,30,648791,648830,-39]
[171,14,2,false,29,652630,652730,-100]
[172,14,3,false,30,656469,656500,-31]
[173,14,4,false,29,660308,660400,-92]
[174,14,5,false,30,664147,664170,-23]
[175,14,6,false,29,667986,668070,-84]
[176,14,7,false,30,671825,671840,-15]
[177,14,8,false,29,675664,675740,-76]
[178,14,9,false,30,679503,679510,-7]
[179,14,10,false,29,683342,683410,-68]
[180,14,11,false,30,687181,687180,1]
[181,14,12,false,29,691020,691080,-60]
[182,14,13,false,30,694859,694850,9]
[183,15,1,false,30,698698,698750,-52]
[184,15,2,false,29,702537,702650,-113]
[185,15,3,false,30,706376,706420,-44]
[186,15,4,false,29,710215,710320,-105]
[187,15,5,false,30,714054,714090,-36]
[188,15,6,false,29,717893,717990,-97]
[189,15,7,false,30,721732,721760,-28]
[190,15,8,false,29,725571,725660,-89]
[191,15,9,false,30,729410,729430,-20]
[192,15,10,false,29,733249,733330,-81]
[193,15,11,false,30,737088,737100,{"$f":"F213-G213","v":-12}]
[194,{"$f":"IF(C214=1,B213+1,B213)","v":15},12,{"$f":"AND(MOD(B214,10)=0,C214=13)","v":false},{"$f":"IF(MOD(C214,2)=1,30,29)-IF(D214,1,0)","v":29},740927,{"$f":"G213+E213*PPD","v":741000},-73]
[195,15,{"$f":"IF(C214=13,1,C214+1)","v":13},false,30,{"$f":"F214+PPM","v":744766},744770,-4]
[196,16,1,false,30,748605,748670,-65]
[197,16,2,false,29,752444,752570,-126]
[198,16,3,false,30,756283,756340,-57]
[199,16,4,false,29,760122,760240,-118]
[200,16,5,false,30,763961,764010,-49]
[201,16,6,false,29,767800,767910,-110]
[202,16,7,false,30,771639,771680,-41]
[203,16,8,false,29,775478,775580,-102]
[204,16,9,false,30,779317,779350,-33]
[205,16,10,false,29,783156,783250,-94]
[206,16,11,false,30,786995,787020,-25]
[207,16,12,false,29,790834,790920,-86]
[208,16,13,false,30,794673,794690,-17]
[209,17,1,false,30,798512,798590,-78]
[210,17,2,false,29,802351,802490,-139]
[211,17,3,false,30,806190,806260,-70]
[212,17,4,false,29,810029,810160,-131]
[213,17,5,false,30,813868,813930,-62]
[214,17,6,false,29,817707,817830,-123]
[215,17,7,false,30,821546,821600,-54]
[216,17,8,false,29,825385,825500,-115]
[217,17,9,false,30,829224,829270,-46]
[218,17,10,false,29,833063,833170,-107]
[219,17,11,false,30,836902,836940,-38]
[220,17,12,false,29,840741,840840,-99]
[221,17,13,false,30,844580,844610,-30]
[222,18,1,false,30,848419,848510,-91]
[223,18,2,false,29,852258,852410,-152]
[224,18,3,false,30,856097,856180,-83]
[225,18,4,false,29,859936,860080,-144]
[226,18,5,false,30,863775,863850,-75]
[227,18,6,false,29,867614,867750,-136]
[{"$f":"A247+1","v":228},18,7,false,30,871453,871520,-67]
[229,18,8,false,29,875292,875420,-128]
[230,18,9,false,30,879131,879190,-59]
[231,18,10,false,29,882970,883090,-120]
[232,18,11,false,30,886809,886860,-51]
[233,18,12,false,29,890648,890760,-112]
[234,18,13,false,30,894487,894530,-43]
[235,19,1,false,30,898326,898430,-104]
[236,19,2,false,29,902165,902330,-165]
[237,19,3,false,30,906004,906100,-96]
[238,19,4,false,29,909843,910000,-157]
[239,19,5,false,30,913682,913770,-88]
[240,19,6,false,29,917521,917670,-149]
[241,19,7,false,30,921360,921440,-80]
[242,19,8,false,29,925199,925340,-141]
[243,19,9,false,30,929038,929110,-72]
[244,19,10,false,29,932877,933010,-133]
[245,19,11,false,30,936716,936780,-64]
[246,19,12,false,29,940555,940680,-125]
[247,19,13,false,30,944394,944450,-56]
[248,20,1,false,30,948233,948350,-117]
[249,20,2,false,29,952072,952250,-178]
[250,20,3,false,30,955911,956020,-109]
[251,20,4,false,29,959750,959920,-170]
[252,20,5,false,30,963589,963690,-101]
[253,20,6,false,29,967428,967590,-162]
[254,20,7,false,30,971267,971360,-93]
[255,20,8,false,29,975106,975260,-154]
[256,20,9,false,30,978945,979030,-85]
[257,20,10,false,29,982784,982930,{"$f":"F277-G277","v":-146}]
[258,{"$f":"IF(C278=1,B277+1,B277)","v":20},11,{"$f":"AND(MOD(B278,10)=0,C278=13)","v":false},{"$f":"IF(MOD(C278,2)=1,30,29)-IF(D278,1,0)","v":30},986623,{"$f":"G277+E277*PPD","v":986700},-77]
[259,20,{"$f":"IF(C278=13,1,C278+1)","v":12},false,29,{"$f":"F278+PPM","v":990462},990600,-138]
[260,20,13,true,29,994301,994370,-69]
[261,21,1,false,30,998140,998140,0]
[262,21,2,false,29,1001979,1002040,-61]
[263,21,3,false,30,1005818,1005810,8]
[264,21,4,false,29,1009657,1009710,-53]
[265,21,5,false,30,1013496,1013480,16]
[266,21,6,false,29,1017335,1017380,-45]
[267,21,7,false,30,1021174,1021150,24]
[268,21,8,false,29,1025013,1025050,-37]
[269,21,9,false,30,1028852,1028820,32]
[270,21,10,false,29,1032691,1032720,-29]
[271,21,11,false,30,1036530,1036490,40]
[272,21,12,false,29,1040369,1040390,-21]
[273,21,13,false,30,1044208,1044160,48]

{"sheet":"Years","index":2,"n_rows":22,"n_cols":5,"rows_kept":22}
["Month in Cycle","Lunar Year","New Year Moment","Elapsed","Difference"]
[{"$f":"StartMonth","v":13},1,{"$f":"(A2-1)*PPM","v":46068},{"$f":"LOOKUP(A2,Data!A$21:A$293,Data!G$21:G$293)","v":46020},{"$f":"C2-D2","v":48}]
[{"$f":"A2+13","v":26},{"$f":"B2+1","v":2},{"$f":"(A3-1)*PPM","v":95975},{"$f":"LOOKUP(A3,Data!A$21:A$293,Data!G$21:G$293)","v":95940},{"$f":"C3-D3","v":35}]
[{"$f":"A3+13","v":39},{"$f":"B3+1","v":3},145882,{"$f":"LOOKUP(A4,Data!A$21:A$293,Data!G$21:G$293)","v":145860},22]
[52,4,195789,{"$f":"LOOKUP(A5,Data!A$21:A$293,Data!G$21:G$293)","v":195780},9]
[65,5,245696,{"$f":"LOOKUP(A6,Data!A$21:A$293,Data!G$21:G$293)","v":245700},-4]
[78,6,295603,{"$f":"LOOKUP(A7,Data!A$21:A$293,Data!G$21:G$293)","v":295620},-17]
[91,7,345510,{"$f":"LOOKUP(A8,Data!A$21:A$293,Data!G$21:G$293)","v":345540},-30]
[104,8,395417,{"$f":"LOOKUP(A9,Data!A$21:A$293,Data!G$21:G$293)","v":395460},-43]
[117,9,445324,{"$f":"LOOKUP(A10,Data!A$21:A$293,Data!G$21:G$293)","v":445380},-56]
[130,10,495231,{"$f":"LOOKUP(A11,Data!A$21:A$293,Data!G$21:G$293)","v":495300},-69]
[143,11,545138,{"$f":"LOOKUP(A12,Data!A$21:A$293,Data!G$21:G$293)","v":545090},48]
[156,12,595045,{"$f":"LOOKUP(A13,Data!A$21:A$293,Data!G$21:G$293)","v":595010},35]
[169,13,644952,{"$f":"LOOKUP(A14,Data!A$21:A$293,Data!G$21:G$293)","v":644930},22]
[182,14,694859,{"$f":"LOOKUP(A15,Data!A$21:A$293,Data!G$21:G$293)","v":694850},9]
[195,15,744766,{"$f":"LOOKUP(A16,Data!A$21:A$293,Data!G$21:G$293)","v":744770},-4]
[208,16,794673,{"$f":"LOOKUP(A17,Data!A$21:A$293,Data!G$21:G$293)","v":794690},-17]
[221,17,844580,{"$f":"LOOKUP(A18,Data!A$21:A$293,Data!G$21:G$293)","v":844610},-30]
[234,18,894487,{"$f":"LOOKUP(A19,Data!A$21:A$293,Data!G$21:G$293)","v":894530},-43]
[247,19,944394,{"$f":"LOOKUP(A20,Data!A$21:A$293,Data!G$21:G$293)","v":944450},-56]
[260,20,994301,{"$f":"LOOKUP(A21,Data!A$21:A$293,Data!G$21:G$293)","v":994370},-69]
[273,21,1044208,{"$f":"LOOKUP(A22,Data!A$21:A$293,Data!G$21:G$293)","v":1044160},48]

{"sheet":"Years2","index":3,"n_rows":22,"n_cols":5,"rows_kept":22}
["Month in Cycle","Lunar Year","New Year Moment","Elapsed","Difference"]
[{"$f":"StartMonth2","v":2},1,{"$f":"(A2-1)*PPM","v":3839},{"$f":"LOOKUP(A2,Data!A$21:A$293,Data!G$21:G$293)","v":3900},{"$f":"C2-D2","v":-61}]
[{"$f":"A2+13","v":15},{"$f":"B2+1","v":2},53746,{"$f":"LOOKUP(A3,Data!A$21:A$293,Data!G$21:G$293)","v":53820},-74]
[28,3,103653,{"$f":"LOOKUP(A4,Data!A$21:A$293,Data!G$21:G$293)","v":103740},-87]
[41,4,153560,{"$f":"LOOKUP(A5,Data!A$21:A$293,Data!G$21:G$293)","v":153660},-100]
[54,5,203467,{"$f":"LOOKUP(A6,Data!A$21:A$293,Data!G$21:G$293)","v":203580},-113]
[67,6,253374,{"$f":"LOOKUP(A7,Data!A$21:A$293,Data!G$21:G$293)","v":253500},-126]
[80,7,303281,{"$f":"LOOKUP(A8,Data!A$21:A$293,Data!G$21:G$293)","v":303420},-139]
[93,8,353188,{"$f":"LOOKUP(A9,Data!A$21:A$293,Data!G$21:G$293)","v":353340},-152]
[106,9,403095,{"$f":"LOOKUP(A10,Data!A$21:A$293,Data!G$21:G$293)","v":403260},-165]
[119,10,453002,{"$f":"LOOKUP(A11,Data!A$21:A$293,Data!G$21:G$293)","v":453180},-178]
[132,11,502909,{"$f":"LOOKUP(A12,Data!A$21:A$293,Data!G$21:G$293)","v":502970},-61]
[145,12,552816,{"$f":"LOOKUP(A13,Data!A$21:A$293,Data!G$21:G$293)","v":552890},-74]
[158,13,602723,{"$f":"LOOKUP(A14,Data!A$21:A$293,Data!G$21:G$293)","v":602810},-87]
[171,14,652630,{"$f":"LOOKUP(A15,Data!A$21:A$293,Data!G$21:G$293)","v":652730},-100]
[184,15,702537,{"$f":"LOOKUP(A16,Data!A$21:A$293,Data!G$21:G$293)","v":702650},-113]
[197,16,752444,{"$f":"LOOKUP(A17,Data!A$21:A$293,Data!G$21:G$293)","v":752570},-126]
[210,17,802351,{"$f":"LOOKUP(A18,Data!A$21:A$293,Data!G$21:G$293)","v":802490},-139]
[223,18,852258,{"$f":"LOOKUP(A19,Data!A$21:A$293,Data!G$21:G$293)","v":852410},-152]
[236,19,902165,{"$f":"LOOKUP(A20,Data!A$21:A$293,Data!G$21:G$293)","v":902330},-165]
[249,20,952072,{"$f":"LOOKUP(A21,Data!A$21:A$293,Data!G$21:G$293)","v":952250},-178]
[262,21,1001979,{"$f":"LOOKUP(A22,Data!A$21:A$293,Data!G$21:G$293)","v":1002040},-61]

{"sheet":"Rules","index":4,"n_rows":13,"n_cols":3,"rows_kept":13}
["Lunar year has 13 months"]
["470 thirteen-month lunar years per cycle"]
[{"$f":"470*13","v":6110},"months"]
["odd-numbered months have 30 days, even numbered months have 29 days"]
["so common years have 7 full months and 6 deficient months"]
["length of common year =",{"$f":"6*29+7*30","v":384}]
["but when the year number is divisible by 10 or 235 one day is removed from the last month"]
["so instead of having",{"$f":"7*470","v":3290},"full months per cycle"]
[null,47,"are removed for years divisible by 10"]
[null,1,"is removed for years divisible by 235 (470 is already a leap year because it is divisible by 10)"]
[null,{"$f":"B8-B9-B10","v":3242}]
[{"$f":"\"so the mean month = 29+\"&B11&\"/\"&A3&\" days = 29+\"&reducefraction(3242,6110,FALSE,FALSE,TRUE)&\" days\"","v":"so the mean month = 29+3242/6110 days = 29+1621/3055 days"}]
["and so the overall calendar cycle is a double lunar cycle."]

{"sheet":"Zoom","index":5,"n_rows":7,"n_cols":9,"rows_kept":7}
[0,"= Current Zoom Level"]
["Level","Months","MajorTick","MinorTick","Shift","Connect","Years","YearsMajor","YearsMinor"]
[{"$f":"ROW()-3","v":0},{"$f":"2*MPC","v":260},13,13,null,false,{"$f":"B3/13","v":20},1,1]
[{"$f":"ROW()-3","v":1},{"$f":"B3/2","v":130},13,1,{"$f":"B4/2","v":65},true,{"$f":"B4/13","v":10},1,{"$f":"1/13","v":0.07692307692307693}]
[{"$f":"ROW()-3","v":2},{"$f":"B4/2","v":65},13,1,26,true,{"$f":"B5/13","v":5},1,{"$f":"1/13","v":0.07692307692307693}]
[{"$f":"ROW()-3","v":3},26,1,1,13,true,{"$f":"B6/13","v":2},1,{"$f":"1/13","v":0.07692307692307693}]
[{"$f":"ROW()-3","v":4},{"$f":"B6/2","v":13},1,1,13,true,{"$f":"B7/13","v":1},1,{"$f":"1/13","v":0.07692307692307693}]

{"sheet":"Labels","index":6,"n_rows":28,"n_cols":3,"rows_kept":28}
["Lunar Year","Hours",{"$f":"\"Span \"&B2-B28&\"h\"","v":"Span 78h"}]
[21,30]
[{"$f":"A2","v":21},{"$f":"B2-3","v":27}]
[{"$f":"A3","v":21},{"$f":"B3-3","v":24}]
[{"$f":"A4","v":21},21]
[{"$f":"A5","v":21},18]
[21,15]
[21,12]
[21,9]
[21,6]
[21,3]
[21,0]
[21,-3]
[21,-6]
[21,-9]
[{"$f":"A15","v":21},{"$f":"B15-3","v":-12}]
[21,-15]
[21,-18]
[21,-21]
[21,-24]
[21,-27]
[21,-30]
[21,-33]
[{"$f":"A23","v":21},{"$f":"B23-3","v":-36}]
[{"$f":"A24","v":21},{"$f":"B24-3","v":-39}]
[{"$f":"A25","v":21},{"$f":"B25-3","v":-42}]
[{"$f":"A26","v":21},{"$f":"B26-3","v":-45}]
[{"$f":"A27","v":21},{"$f":"B27-3","v":-48}]