{"text_format":"3","workbook":"xlsx","n_sheets":6,"sheets":["Chart","Data","Solar Cycle","Lunar Cycle","Zoom","Labels"],"not_rendered":{"charts":1,"macros":1,"defined_names":21,"comments":1},"read":"whole","date_system":"1900"}

{"sheet":"Chart","index":0,"n_rows":45,"n_cols":17,"rows_kept":45}
["Orthodox Easter Computus Jitter (Easter Sunday relative to Mean Elapsed Months)"]
[{"$f":"\"Solar cycle contains 28 years (common = 365 days, every 4th year leap = 366 days) = \"&(28*365+7)&\" days per cycle = \"&reducefraction(28*365+7,7,FALSE,FALSE,TRUE)&\" weeks per cycle.\"","v":"Solar cycle contains 28 years (common = 365 days, every 4th year leap = 366 days) = 10227 days per cycle = 1461 weeks per cycle."}]
[{"$f":"\"Lunar cycle contains \"&MPC&\" months (\"&FMPC&\" full, \"&DMPC&\" deficient) = \"&DPC&\" days = \"&reducefraction(DPC,7,FALSE,FALSE,TRUE)&\" weeks = \"&Yerms&\" yerms. Lunisolar cycle = 28 x 19 = \"&(28*19)&\" years.\"","v":"Lunar cycle contains 940 months (499 full, 441 deficient) = 27759 days = 3965+4/7 weeks = 58 yerms. Lunisolar cycle = 28 x 19 = 532 years."}]
[{"$f":"\"Mean month = \"&\"29+\"&reducefraction(FMPC,MPC,FALSE,FALSE,TRUE)&\" days = 29d 12h 44m \"&reducefraction(240*(360*FMPC-191*MPC),MPC,FALSE,FALSE,TRUE)&\" seconds, or about 29\"&MID(FMPC/MPC,2,20)&\" days or 29d 12h 44m \"&ROUND(240*(360*FMPC-191*MPC)/MPC,6)&\" seconds.\"","v":"Mean month = 29+499/940 days = 29d 12h 44m 25+25/47 seconds, or about 29.530851063829787 days or 29d 12h 44m 25.531915 seconds."}]
[{"$f":"\"Duration per ''Part'' = 1/\"&MPC&\" day = \"&reducefraction(24,MPC,FALSE,FALSE,TRUE)&\" hour = \"&reducefraction(1440,MPC,FALSE,FALSE,TRUE)&\" minutes = \"&reducefraction(86400,MPC,FALSE,FALSE,TRUE)&\" seconds.  One hour = \"&reducefraction(MPC,24,FALSE,FALSE,TRUE)&\" parts.\"","v":"Duration per ''Part'' = 1/940 day = 6/235 hour = 1+25/47 minutes = 91+43/47 seconds.  One hour = 39+1/6 parts."}]
[]
[{"$nulls":16},true]
{"$rows_empty":9}
[{"$nulls":16},26]
[{"$nulls":16},"Selected"]
[{"$nulls":16},"Year in"]
[{"$nulls":16},"Solar Cycle"]
[{"$nulls":16},"(1 to 28)"]
{"$rows_empty":9}
[{"$nulls":16},1]
[{"$nulls":16},"Selected"]
[{"$nulls":16},"Year in"]
[{"$nulls":16},"Lunar Cycle"]
[{"$nulls":16},"(1 to 19)"]
{"$rows_empty":9}
[{"$nulls":8},{"$f":"ZoomLevel","v":1}]

{"sheet":"Data","index":1,"n_rows":591,"n_cols":9,"rows_kept":591}
["Lunar Cycle Jitter Evaluator"]
["by Dr. Irv Bromberg, University of Toronto, Canada"]
["http://individual.utoronto.ca/intervalmath/jitter/index.html",null,null,"Jitter","(parts)"]
["Decimal Mean Month:",{"$f":"29+FMPC/MPC","v":29.530851063829786},null,{"$f":"MAX(I:I)","v":6101},"maximum",{"$f":"reducefraction(JitterMax*MPC,MPC,FALSE,FALSE,FALSE)","v":"6101"}]
["Months per Cycle (Parts per Day):",940,"months (parts)",{"$f":"MIN(I:I)","v":-1410},"minimum",{"$f":"reducefraction(JitterMin*MPC,MPC,FALSE,FALSE,FALSE)","v":"–(1410)"}]
["30-day Months per Cycle:",499,"months",{"$f":"D4-D5","v":7511},"range",{"$f":"reducefraction(JitterRange*MPC,MPC,FALSE,FALSE,FALSE)","v":"7511"}]
["29-day Months per Cycle:",{"$f":"MPC-FMPC","v":441},"months",{"$f":"\"Jitter range = \"&F6&\" parts = \"&reducefraction(F6*24,MPC,FALSE,FALSE,FALSE)&\" hours\"","v":"Jitter range = 7511 parts = 191 + 181 / 235 hours"}]
["Days per Cycle (Parts per Month):",{"$f":"29*MPC+FMPC","v":27759},"days (parts)",null,"Years Per Cycle:",{"$f":"4*19","v":76}]
["Yerms per Cycle:",{"$f":"2*DPC-59*MPC","v":58},"yerms","Limits for Chart:"]
["Mean Month:",{"$f":"\"29 + \"&reducefraction(FMPC,MPC,FALSE,FALSE,FALSE)","v":"29 + 499 / 940"},"days","x","y","Hours"]
["Mean Month >29d:",{"$f":"FMPC/MPC","v":{"v":0.5308510638297872,"d":"0.530851063829787"}},"days",{"$f":"A22","v":1},{"$f":"JitterMax","v":6101},{"$f":"E11*24/MPC","v":155.77021276595744}]
["Mean Month >29d 12h 44m:",{"$f":"reducefraction(240*(360*FMPC-191*MPC),MPC,FALSE,FALSE,TRUE)","v":"25+25/47"},"seconds",{"$f":"7*YPC+1","v":533},{"$f":"E11","v":6101},{"$f":"E12*24/MPC","v":155.77021276595744}]
["… or approximately:",{"$f":"240*(360*FMPC-191*MPC)/MPC","v":25.53191489361702},"seconds"]
["Has Yerm Zero:",{"$f":"MeanMonth>26/49","v":true},null,{"$f":"D11","v":1},0]
["17-month Yerms per Cycle:",{"$f":"443*MPC-15*DPC","v":35},"yerms",{"$f":"D12","v":533},0]
["15-month Yerms per Cycle:",{"$f":"Yerms-n17my","v":23},"yerms"]
["49-month subcycles:",{"$f":"INT(Yerms/3)","v":19},null,{"$f":"A22","v":1},{"$f":"JitterMin","v":-1410},{"$f":"E17*24/MPC","v":-36}]
["Duration per Part:",{"$f":"reducefraction(1440,MPC,FALSE,FALSE,FALSE)","v":"1 + 25 / 47"},"minutes",{"$f":"D12","v":533},{"$f":"E17","v":-1410},{"$f":"E18*24/MPC","v":-36}]
[{"$nulls":6},"Elapsed","Elapsed"]
[{"$nulls":3},"Easter Sunday","Elapsed","Easter Sunday","Lunar","Mean Month","Difference"]
["Julian Year","isLeapYear","Year Length","(days)","Days","(parts)","Months","Parts","(parts)"]
[1,{"$f":"isJulianLeapYear(A22)","v":false},{"$f":"IF(B22,366,365)","v":365},{"$f":"OrthodoxEaster(A22)","v":84},null,0,null,0,{"$f":"F22-H22","v":0}]
[{"$f":"A22+1","v":2},{"$f":"isJulianLeapYear(A23)","v":false},{"$f":"IF(B23,366,365)","v":365},{"$f":"OrthodoxEaster(A23)","v":469},{"$f":"D23-D22","v":385},{"$f":"F22+(D23-D22)*PPD","v":361900},{"$f":"ROUND((D23-D22)/DecMeanMon,0)","v":13},{"$f":"H22+G23*PPM","v":360867},{"$f":"F23-H23","v":1033}]
[{"$f":"A23+1","v":3},false,365,826,357,{"$f":"F23+(D24-D23)*PPD","v":697480},12,{"$f":"H23+G24*PPM","v":693975},3505]
[4,true,366,1176,350,1026480,12,1027083,-603]
[5,false,365,1561,385,1388380,13,1387950,430]
[6,false,365,1918,357,1723960,12,1721058,2902]
[7,false,365,2303,385,2085860,13,2081925,3935]
[8,true,366,2653,350,2414860,12,2415033,-173]
[9,false,365,3010,357,2750440,12,2748141,2299]
[10,false,365,3395,385,3112340,13,3109008,3332]
[11,false,365,3745,350,3441340,12,3442116,-776]
[12,true,366,4102,357,3776920,12,3775224,1696]
[13,false,365,4487,385,4138820,13,4136091,2729]
[14,false,365,4844,357,4474400,12,4469199,5201]
[15,false,365,5194,350,4803400,12,4802307,1093]
[16,true,366,5579,385,5165300,13,5163174,2126]
[17,false,365,5936,357,5500880,12,5496282,4598]
[18,false,365,6321,385,5862780,13,5857149,5631]
[19,false,365,6671,350,6191780,12,6190257,1523]
[20,true,366,7028,357,6527360,12,6523365,3995]
[21,false,365,7413,385,6889260,13,6884232,5028]
[22,false,365,7763,350,7218260,12,7217340,920]
[23,false,365,8120,357,7553840,12,7550448,3392]
[24,true,366,8505,385,7915740,13,7911315,4425]
[25,false,365,8855,350,8244740,12,8244423,317]
[26,false,365,9240,385,8606640,13,8605290,1350]
[27,false,365,9597,357,8942220,12,8938398,3822]
[28,true,366,9947,350,9271220,12,9271506,-286]
[29,false,365,10332,385,9633120,13,9632373,747]
[30,false,365,10689,357,9968700,12,9965481,3219]
[31,false,365,11039,350,10297700,12,10298589,-889]
[32,true,366,11424,385,10659600,13,10659456,144]
[33,false,365,11781,357,10995180,12,10992564,2616]
[34,false,365,12138,{"$f":"D55-D54","v":357},11330760,12,11325672,5088]
[35,false,365,12516,378,11686080,13,11686539,-459]
[36,true,366,12873,357,12021660,12,12019647,2013]
[37,false,365,13258,385,12383560,13,12380514,3046]
[38,false,365,13608,350,12712560,12,12713622,-1062]
[39,false,365,13965,357,13048140,12,13046730,1410]
[40,true,366,14350,385,13410040,13,13407597,2443]
[41,false,365,14707,357,13745620,12,13740705,4915]
[42,false,365,15057,350,14074620,12,14073813,807]
[43,false,365,15442,385,14436520,13,14434680,1840]
[44,true,366,15799,357,14772100,12,14767788,4312]
[45,false,365,16184,385,15134000,13,15128655,5345]
[46,false,365,16534,350,15463000,12,15461763,1237]
[47,false,365,16891,357,15798580,12,15794871,3709]
[48,true,366,17276,385,16160480,13,16155738,4742]
[49,false,365,17626,350,16489480,12,16488846,634]
[50,false,365,17983,357,16825060,12,16821954,3106]
[51,false,365,18368,385,17186960,13,17182821,4139]
[52,true,366,18718,350,17515960,12,17515929,31]
[53,false,365,19075,357,17851540,12,17849037,2503]
[54,false,365,19460,385,18213440,13,18209904,3536]
[55,false,365,19810,350,18542440,12,18543012,-572]
[56,true,366,20195,385,18904340,13,18903879,461]
[57,false,365,20552,357,19239920,12,19236987,2933]
[58,false,365,20902,350,19568920,12,19570095,-1175]
[59,false,365,21287,385,19930820,13,19930962,-142]
[60,true,366,21644,357,20266400,12,20264070,2330]
[61,false,365,22001,357,20601980,12,20597178,4802]
[62,false,365,22379,378,20957300,13,20958045,-745]
[63,false,365,22736,357,21292880,12,21291153,1727]
[64,true,366,23121,385,21654780,13,21652020,2760]
[65,false,365,23478,357,21990360,12,21985128,5232]
[66,{"$f":"isJulianLeapYear(A87)","v":false},{"$f":"IF(B87,366,365)","v":365},{"$f":"OrthodoxEaster(A87)","v":23828},{"$f":"D87-D86","v":350},22319360,{"$f":"ROUND((D87-D86)/DecMeanMon,0)","v":12},22318236,{"$f":"F87-H87","v":1124}]
[{"$f":"A87+1","v":67},false,365,24213,{"$f":"D88-D87","v":385},{"$f":"F87+(D88-D87)*PPD","v":22681260},13,{"$f":"H87+G88*PPM","v":22679103},{"$f":"F88-H88","v":2157}]
[{"$f":"A88+1","v":68},true,366,24570,{"$f":"D89-D88","v":357},{"$f":"F88+(D89-D88)*PPD","v":23016840},12,{"$f":"H88+G89*PPM","v":23012211},{"$f":"F89-H89","v":4629}]
[{"$f":"A89+1","v":69},false,365,24920,{"$f":"D90-D89","v":350},{"$f":"F89+(D90-D89)*PPD","v":23345840},12,{"$f":"H89+G90*PPM","v":23345319},{"$f":"F90-H90","v":521}]
[{"$f":"A90+1","v":70},false,365,25305,{"$f":"D91-D90","v":385},{"$f":"F90+(D91-D90)*PPD","v":23707740},13,{"$f":"H90+G91*PPM","v":23706186},{"$f":"F91-H91","v":1554}]
[71,false,365,25662,357,24043320,12,24039294,4026]
[72,true,366,26012,350,24372320,12,24372402,-82]
[73,false,365,26397,385,24734220,13,24733269,951]
[74,false,365,26754,357,25069800,12,25066377,3423]
[75,false,365,27139,385,25431700,13,25427244,4456]
[76,true,366,27489,350,25760700,12,25760352,348]
[77,false,365,27846,357,26096280,12,26093460,2820]
[78,false,365,28231,385,26458180,13,26454327,3853]
[79,false,365,28581,350,26787180,12,26787435,-255]
[80,true,366,28938,357,27122760,12,27120543,2217]
[81,false,365,29323,385,27484660,13,27481410,3250]
[82,false,365,29673,350,27813660,12,27814518,-858]
[83,false,365,30058,385,28175560,13,28175385,175]
[84,true,366,30415,357,28511140,12,28508493,2647]
[85,false,365,30772,357,28846720,12,28841601,5119]
[86,false,365,31150,378,29202040,13,29202468,-428]
[87,false,365,31507,357,29537620,12,29535576,2044]
[88,true,366,31864,357,29873200,12,29868684,4516]
[89,false,365,32249,385,30235100,13,30229551,5549]
[90,false,365,32599,350,30564100,12,30562659,1441]
[91,false,365,32956,357,30899680,12,30895767,3913]
[92,true,366,33341,385,31261580,13,31256634,4946]
[93,false,365,33691,350,31590580,12,31589742,838]
[94,false,365,34076,385,31952480,13,31950609,1871]
[95,false,365,34433,357,32288060,12,32283717,4343]
[96,true,366,34783,350,32617060,12,32616825,235]
[97,false,365,35168,385,32978960,13,32977692,1268]
[98,{"$f":"isJulianLeapYear(A119)","v":false},{"$f":"IF(B119,366,365)","v":365},35525,357,33314540,12,33310800,3740]
[99,false,365,35875,350,33643540,12,33643908,-368]
{"$rows_left_out":472}
{"sheet":"Solar Cycle","index":2,"n_rows":28,"n_cols":6,"rows_kept":28}
["Year in Solar Cycle","Solar Cycle","Easter Sunday","Elapsed","Difference","Top"]
[{"$f":"StartSolar","v":26},1,{"$f":"LOOKUP(A2,Data!A$22:A$591,Data!F$22:F$591)","v":8606640},{"$f":"LOOKUP(A2,Data!A$22:A$591,Data!H$22:H$591)","v":8605290},{"$f":"C2-D2","v":1350},1500]
[{"$f":"A2+28","v":54},{"$f":"MOD(B2,28)+1","v":2},{"$f":"LOOKUP(A3,Data!A$22:A$591,Data!F$22:F$591)","v":18213440},{"$f":"LOOKUP(A3,Data!A$22:A$591,Data!H$22:H$591)","v":18209904},{"$f":"C3-D3","v":3536},{"$f":"F2","v":1500}]
[{"$f":"A3+28","v":82},{"$f":"MOD(B3,28)+1","v":3},{"$f":"LOOKUP(A4,Data!A$22:A$591,Data!F$22:F$591)","v":27813660},{"$f":"LOOKUP(A4,Data!A$22:A$591,Data!H$22:H$591)","v":27814518},{"$f":"C4-D4","v":-858},{"$f":"F3","v":1500}]
[110,4,{"$f":"LOOKUP(A5,Data!A$22:A$591,Data!F$22:F$591)","v":37420460},{"$f":"LOOKUP(A5,Data!A$22:A$591,Data!H$22:H$591)","v":37419132},1328,1500]
[138,5,{"$f":"LOOKUP(A6,Data!A$22:A$591,Data!F$22:F$591)","v":47053580},{"$f":"LOOKUP(A6,Data!A$22:A$591,Data!H$22:H$591)","v":47051505},2075,1500]
[166,6,{"$f":"LOOKUP(A7,Data!A$22:A$591,Data!F$22:F$591)","v":56660380},{"$f":"LOOKUP(A7,Data!A$22:A$591,Data!H$22:H$591)","v":56656119},4261,1500]
[194,7,{"$f":"LOOKUP(A8,Data!A$22:A$591,Data!F$22:F$591)","v":66260600},{"$f":"LOOKUP(A8,Data!A$22:A$591,Data!H$22:H$591)","v":66260733},-133,1500]
[222,8,{"$f":"LOOKUP(A9,Data!A$22:A$591,Data!F$22:F$591)","v":75893720},{"$f":"LOOKUP(A9,Data!A$22:A$591,Data!H$22:H$591)","v":75893106},614,1500]
[250,9,{"$f":"LOOKUP(A10,Data!A$22:A$591,Data!F$22:F$591)","v":85500520},{"$f":"LOOKUP(A10,Data!A$22:A$591,Data!H$22:H$591)","v":85497720},2800,1500]
[278,10,{"$f":"LOOKUP(A11,Data!A$22:A$591,Data!F$22:F$591)","v":95107320},{"$f":"LOOKUP(A11,Data!A$22:A$591,Data!H$22:H$591)","v":95102334},4986,1500]
[306,11,{"$f":"LOOKUP(A12,Data!A$22:A$591,Data!F$22:F$591)","v":104733860},{"$f":"LOOKUP(A12,Data!A$22:A$591,Data!H$22:H$591)","v":104734707},-847,1500]
[334,12,{"$f":"LOOKUP(A13,Data!A$22:A$591,Data!F$22:F$591)","v":114340660},{"$f":"LOOKUP(A13,Data!A$22:A$591,Data!H$22:H$591)","v":114339321},1339,1500]
[362,13,{"$f":"LOOKUP(A14,Data!A$22:A$591,Data!F$22:F$591)","v":123947460},{"$f":"LOOKUP(A14,Data!A$22:A$591,Data!H$22:H$591)","v":123943935},3525,1500]
[390,14,{"$f":"LOOKUP(A15,Data!A$22:A$591,Data!F$22:F$591)","v":133580580},{"$f":"LOOKUP(A15,Data!A$22:A$591,Data!H$22:H$591)","v":133576308},4272,1500]
[418,15,{"$f":"LOOKUP(A16,Data!A$22:A$591,Data!F$22:F$591)","v":143180800},{"$f":"LOOKUP(A16,Data!A$22:A$591,Data!H$22:H$591)","v":143180922},-122,1500]
[446,16,{"$f":"LOOKUP(A17,Data!A$22:A$591,Data!F$22:F$591)","v":152787600},{"$f":"LOOKUP(A17,Data!A$22:A$591,Data!H$22:H$591)","v":152785536},2064,1500]
[474,17,{"$f":"LOOKUP(A18,Data!A$22:A$591,Data!F$22:F$591)","v":162420720},{"$f":"LOOKUP(A18,Data!A$22:A$591,Data!H$22:H$591)","v":162417909},2811,1500]
[502,18,{"$f":"LOOKUP(A19,Data!A$22:A$591,Data!F$22:F$591)","v":172027520},{"$f":"LOOKUP(A19,Data!A$22:A$591,Data!H$22:H$591)","v":172022523},4997,1500]
[530,19,{"$f":"LOOKUP(A20,Data!A$22:A$591,Data!F$22:F$591)","v":181627740},{"$f":"LOOKUP(A20,Data!A$22:A$591,Data!H$22:H$591)","v":181627137},603,1500]
[558,20,{"$f":"LOOKUP(A21,Data!A$22:A$591,Data!F$22:F$591)","v":191260860},{"$f":"LOOKUP(A21,Data!A$22:A$591,Data!H$22:H$591)","v":191259510},1350,1500]
[586,21,{"$f":"LOOKUP(A22,Data!A$22:A$591,Data!F$22:F$591)","v":195366780},{"$f":"LOOKUP(A22,Data!A$22:A$591,Data!H$22:H$591)","v":195367842},-1062,1500]
[614,22,{"$f":"LOOKUP(A23,Data!A$22:A$591,Data!F$22:F$591)","v":195366780},{"$f":"LOOKUP(A23,Data!A$22:A$591,Data!H$22:H$591)","v":195367842},-1062,1500]
[642,23,{"$f":"LOOKUP(A24,Data!A$22:A$591,Data!F$22:F$591)","v":195366780},{"$f":"LOOKUP(A24,Data!A$22:A$591,Data!H$22:H$591)","v":195367842},-1062,1500]
[670,24,{"$f":"LOOKUP(A25,Data!A$22:A$591,Data!F$22:F$591)","v":195366780},{"$f":"LOOKUP(A25,Data!A$22:A$591,Data!H$22:H$591)","v":195367842},-1062,1500]
[698,25,{"$f":"LOOKUP(A26,Data!A$22:A$591,Data!F$22:F$591)","v":195366780},{"$f":"LOOKUP(A26,Data!A$22:A$591,Data!H$22:H$591)","v":195367842},-1062,1500]
[726,26,{"$f":"LOOKUP(A27,Data!A$22:A$591,Data!F$22:F$591)","v":195366780},{"$f":"LOOKUP(A27,Data!A$22:A$591,Data!H$22:H$591)","v":195367842},-1062,1500]
[754,27,{"$f":"LOOKUP(A28,Data!A$22:A$591,Data!F$22:F$591)","v":195366780},{"$f":"LOOKUP(A28,Data!A$22:A$591,Data!H$22:H$591)","v":195367842},-1062,1500]

{"sheet":"Lunar Cycle","index":3,"n_rows":36,"n_cols":6,"rows_kept":36}
["Year in Lunar Cycle","Lunar Cycle","Easter Sunday","Elapsed","Difference","Top"]
[{"$f":"StartLunar","v":1},1,{"$f":"LOOKUP(A2,Data!A$22:A$591,Data!F$22:F$591)","v":0},{"$f":"LOOKUP(A2,Data!A$22:A$591,Data!H$22:H$591)","v":0},{"$f":"C2-D2","v":0},1500]
[{"$f":"A2+19","v":20},{"$f":"MOD(B2,19)+1","v":2},{"$f":"LOOKUP(A3,Data!A$22:A$591,Data!F$22:F$591)","v":6527360},{"$f":"LOOKUP(A3,Data!A$22:A$591,Data!H$22:H$591)","v":6523365},{"$f":"C3-D3","v":3995},{"$f":"F2","v":1500}]
[{"$f":"A3+19","v":39},{"$f":"MOD(B3,19)+1","v":3},{"$f":"LOOKUP(A4,Data!A$22:A$591,Data!F$22:F$591)","v":13048140},{"$f":"LOOKUP(A4,Data!A$22:A$591,Data!H$22:H$591)","v":13046730},{"$f":"C4-D4","v":1410},{"$f":"F3","v":1500}]
[58,4,{"$f":"LOOKUP(A5,Data!A$22:A$591,Data!F$22:F$591)","v":19568920},{"$f":"LOOKUP(A5,Data!A$22:A$591,Data!H$22:H$591)","v":19570095},-1175,1500]
[77,5,{"$f":"LOOKUP(A6,Data!A$22:A$591,Data!F$22:F$591)","v":26096280},{"$f":"LOOKUP(A6,Data!A$22:A$591,Data!H$22:H$591)","v":26093460},2820,1500]
[96,6,{"$f":"LOOKUP(A7,Data!A$22:A$591,Data!F$22:F$591)","v":32617060},{"$f":"LOOKUP(A7,Data!A$22:A$591,Data!H$22:H$591)","v":32616825},235,1500]
[115,7,{"$f":"LOOKUP(A8,Data!A$22:A$591,Data!F$22:F$591)","v":39144420},{"$f":"LOOKUP(A8,Data!A$22:A$591,Data!H$22:H$591)","v":39140190},4230,1500]
[134,8,{"$f":"LOOKUP(A9,Data!A$22:A$591,Data!F$22:F$591)","v":45665200},{"$f":"LOOKUP(A9,Data!A$22:A$591,Data!H$22:H$591)","v":45663555},1645,1500]
[153,9,{"$f":"LOOKUP(A10,Data!A$22:A$591,Data!F$22:F$591)","v":52185980},{"$f":"LOOKUP(A10,Data!A$22:A$591,Data!H$22:H$591)","v":52186920},-940,1500]
[172,10,{"$f":"LOOKUP(A11,Data!A$22:A$591,Data!F$22:F$591)","v":58713340},{"$f":"LOOKUP(A11,Data!A$22:A$591,Data!H$22:H$591)","v":58710285},3055,1500]
[191,11,{"$f":"LOOKUP(A12,Data!A$22:A$591,Data!F$22:F$591)","v":65234120},{"$f":"LOOKUP(A12,Data!A$22:A$591,Data!H$22:H$591)","v":65233650},470,1500]
[210,12,{"$f":"LOOKUP(A13,Data!A$22:A$591,Data!F$22:F$591)","v":71761480},{"$f":"LOOKUP(A13,Data!A$22:A$591,Data!H$22:H$591)","v":71757015},4465,1500]
[229,13,{"$f":"LOOKUP(A14,Data!A$22:A$591,Data!F$22:F$591)","v":78282260},{"$f":"LOOKUP(A14,Data!A$22:A$591,Data!H$22:H$591)","v":78280380},1880,1500]
[248,14,{"$f":"LOOKUP(A15,Data!A$22:A$591,Data!F$22:F$591)","v":84803040},{"$f":"LOOKUP(A15,Data!A$22:A$591,Data!H$22:H$591)","v":84803745},-705,1500]
[267,15,{"$f":"LOOKUP(A16,Data!A$22:A$591,Data!F$22:F$591)","v":91330400},{"$f":"LOOKUP(A16,Data!A$22:A$591,Data!H$22:H$591)","v":91327110},3290,1500]
[286,16,{"$f":"LOOKUP(A17,Data!A$22:A$591,Data!F$22:F$591)","v":97851180},{"$f":"LOOKUP(A17,Data!A$22:A$591,Data!H$22:H$591)","v":97850475},705,1500]
[305,17,{"$f":"LOOKUP(A18,Data!A$22:A$591,Data!F$22:F$591)","v":104378540},{"$f":"LOOKUP(A18,Data!A$22:A$591,Data!H$22:H$591)","v":104373840},4700,1500]
[324,18,{"$f":"LOOKUP(A19,Data!A$22:A$591,Data!F$22:F$591)","v":110899320},{"$f":"LOOKUP(A19,Data!A$22:A$591,Data!H$22:H$591)","v":110897205},2115,1500]
[343,19,{"$f":"LOOKUP(A20,Data!A$22:A$591,Data!F$22:F$591)","v":117420100},{"$f":"LOOKUP(A20,Data!A$22:A$591,Data!H$22:H$591)","v":117420570},-470,1500]
[362,1,{"$f":"LOOKUP(A21,Data!A$22:A$591,Data!F$22:F$591)","v":123947460},{"$f":"LOOKUP(A21,Data!A$22:A$591,Data!H$22:H$591)","v":123943935},3525,1500]
[381,2,{"$f":"LOOKUP(A22,Data!A$22:A$591,Data!F$22:F$591)","v":130468240},{"$f":"LOOKUP(A22,Data!A$22:A$591,Data!H$22:H$591)","v":130467300},940,1500]
[{"$f":"A22+19","v":400},{"$f":"MOD(B22,19)+1","v":3},{"$f":"LOOKUP(A23,Data!A$22:A$591,Data!F$22:F$591)","v":136995600},{"$f":"LOOKUP(A23,Data!A$22:A$591,Data!H$22:H$591)","v":136990665},{"$f":"C23-D23","v":4935},{"$f":"F22","v":1500}]
[419,4,{"$f":"LOOKUP(A24,Data!A$22:A$591,Data!F$22:F$591)","v":143516380},{"$f":"LOOKUP(A24,Data!A$22:A$591,Data!H$22:H$591)","v":143514030},2350,1500]
[438,5,{"$f":"LOOKUP(A25,Data!A$22:A$591,Data!F$22:F$591)","v":150037160},{"$f":"LOOKUP(A25,Data!A$22:A$591,Data!H$22:H$591)","v":150037395},-235,1500]
[457,6,{"$f":"LOOKUP(A26,Data!A$22:A$591,Data!F$22:F$591)","v":156564520},{"$f":"LOOKUP(A26,Data!A$22:A$591,Data!H$22:H$591)","v":156560760},3760,1500]
[476,7,{"$f":"LOOKUP(A27,Data!A$22:A$591,Data!F$22:F$591)","v":163085300},{"$f":"LOOKUP(A27,Data!A$22:A$591,Data!H$22:H$591)","v":163084125},1175,1500]
[495,8,{"$f":"LOOKUP(A28,Data!A$22:A$591,Data!F$22:F$591)","v":169606080},{"$f":"LOOKUP(A28,Data!A$22:A$591,Data!H$22:H$591)","v":169607490},-1410,1500]
[514,9,{"$f":"LOOKUP(A29,Data!A$22:A$591,Data!F$22:F$591)","v":176133440},{"$f":"LOOKUP(A29,Data!A$22:A$591,Data!H$22:H$591)","v":176130855},2585,1500]
[533,10,{"$f":"LOOKUP(A30,Data!A$22:A$591,Data!F$22:F$591)","v":182654220},{"$f":"LOOKUP(A30,Data!A$22:A$591,Data!H$22:H$591)","v":182654220},0,1500]
[552,11,{"$f":"LOOKUP(A31,Data!A$22:A$591,Data!F$22:F$591)","v":189181580},{"$f":"LOOKUP(A31,Data!A$22:A$591,Data!H$22:H$591)","v":189177585},3995,1500]
[571,12,{"$f":"LOOKUP(A32,Data!A$22:A$591,Data!F$22:F$591)","v":195366780},{"$f":"LOOKUP(A32,Data!A$22:A$591,Data!H$22:H$591)","v":195367842},-1062,1500]
[590,13,{"$f":"LOOKUP(A33,Data!A$22:A$591,Data!F$22:F$591)","v":195366780},{"$f":"LOOKUP(A33,Data!A$22:A$591,Data!H$22:H$591)","v":195367842},-1062,1500]
[609,14,{"$f":"LOOKUP(A34,Data!A$22:A$591,Data!F$22:F$591)","v":195366780},{"$f":"LOOKUP(A34,Data!A$22:A$591,Data!H$22:H$591)","v":195367842},-1062,1500]
[628,15,{"$f":"LOOKUP(A35,Data!A$22:A$591,Data!F$22:F$591)","v":195366780},{"$f":"LOOKUP(A35,Data!A$22:A$591,Data!H$22:H$591)","v":195367842},-1062,1500]
[647,16,{"$f":"LOOKUP(A36,Data!A$22:A$591,Data!F$22:F$591)","v":195366780},{"$f":"LOOKUP(A36,Data!A$22:A$591,Data!H$22:H$591)","v":195367842},-1062,1500]

{"sheet":"Zoom","index":4,"n_rows":9,"n_cols":6,"rows_kept":9}
[1,"= Current Zoom Level"]
["Level","Years","MajorTick","MinorTick","Shift","Connect"]
[{"$f":"ROW()-3","v":0},532,76,19,null,false]
[1,532,76,19,null,true]
[2,{"$f":"B4/2","v":266},19,1,76,true]
[3,152,19,1,76,true]
[4,152,4,1,76,true]
[5,76,4,1,{"$f":"2*19","v":38},true]
[6,19,1,1,19,true]

{"sheet":"Labels","index":5,"n_rows":17,"n_cols":3,"rows_kept":17}
["Year","Hours",{"$f":"\"Span \"&B2-B17&\"h\"","v":"Span 225h"}]
[533,180]
[{"$f":"A2","v":533},{"$f":"B2-15","v":165}]
[{"$f":"A3","v":533},{"$f":"B3-15","v":150}]
[{"$f":"A4","v":533},135]
[{"$f":"A5","v":533},120]
[533,105]
[533,90]
[533,75]
[533,60]
[533,45]
[533,30]
[533,15]
[533,0]
[533,-15]
[533,-30]
[{"$f":"A16","v":533},-45]