{"text_format":"3","workbook":"xlsx","n_sheets":6,"sheets":["Chart","Data","Solar Cycle","Lunar Cycle","Zoom","Labels"],"not_rendered":{"charts":1,"macros":1,"external_links":1,"defined_names":23,"comments":1},"read":"whole","date_system":"1900"}

{"sheet":"Chart","index":0,"n_rows":45,"n_cols":17,"rows_kept":45}
["Orthodox Easter Computus Jitter (Paschal Moon relative to Mean Elapsed Months)"]
[{"$f":"\"Solar cycle contains 28 years (common = 365 days, every 4th year leap = 366 days) = \"&(28*365+7)&\" days per cycle = \"&reducefraction(28*365+7,7,FALSE,FALSE,TRUE)&\" weeks per cycle.\"","v":"Solar cycle contains 28 years (common = 365 days, every 4th year leap = 366 days) = 10227 days per cycle = 1461 weeks per cycle."}]
[{"$f":"\"Lunar cycle contains \"&MPC&\" months (\"&FMPC&\" full, \"&DMPC&\" deficient) = \"&DPC&\" days = \"&reducefraction(DPC,7,FALSE,FALSE,TRUE)&\" weeks = \"&Yerms&\" yerms. Lunisolar cycle = 28 x 19 = \"&(28*19)&\" years.\"","v":"Lunar cycle contains 940 months (499 full, 441 deficient) = 27759 days = 3965+4/7 weeks = 58 yerms. Lunisolar cycle = 28 x 19 = 532 years."}]
[{"$f":"\"Mean month = \"&\"29+\"&reducefraction(FMPC,MPC,FALSE,FALSE,TRUE)&\" days = 29d 12h 44m \"&reducefraction(240*(360*FMPC-191*MPC),MPC,FALSE,FALSE,TRUE)&\" seconds, or about 29\"&MID(FMPC/MPC,2,20)&\" days or 29d 12h 44m \"&ROUND(240*(360*FMPC-191*MPC)/MPC,6)&\" seconds.\"","v":"Mean month = 29+499/940 days = 29d 12h 44m 25+25/47 seconds, or about 29.530851063829787 days or 29d 12h 44m 25.531915 seconds."}]
[{"$f":"\"Duration per ''Part'' = 1/\"&MPC&\" day = \"&reducefraction(24,MPC,FALSE,FALSE,TRUE)&\" hour = \"&reducefraction(1440,MPC,FALSE,FALSE,TRUE)&\" minutes = \"&reducefraction(86400,MPC,FALSE,FALSE,TRUE)&\" seconds.  One hour = \"&reducefraction(MPC,24,FALSE,FALSE,TRUE)&\" parts.\"","v":"Duration per ''Part'' = 1/940 day = 6/235 hour = 1+25/47 minutes = 91+43/47 seconds.  One hour = 39+1/6 parts."}]
[]
[]
[{"$nulls":16},true]
{"$rows_empty":10}
[{"$nulls":16},3]
[{"$nulls":16},"Selected"]
[{"$nulls":16},"Year in"]
[{"$nulls":16},"Solar Cycle"]
[{"$nulls":16},"(1 to 28)"]
{"$rows_empty":8}
[{"$nulls":16},18]
[{"$nulls":16},"Selected"]
[{"$nulls":16},"Year in"]
[{"$nulls":16},"Lunar Cycle"]
[{"$nulls":16},"(1 to 19)"]
{"$rows_empty":8}
[{"$nulls":8},{"$f":"ZoomLevel","v":1}]

{"sheet":"Data","index":1,"n_rows":591,"n_cols":9,"rows_kept":591}
["Lunar Cycle Jitter Evaluator"]
["by Dr. Irv Bromberg, University of Toronto, Canada"]
["http://individual.utoronto.ca/intervalmath/jitter/index.html",null,null,"Jitter","(parts)"]
["Decimal Mean Month:",{"$f":"29+FMPC/MPC","v":29.530851063829786},null,{"$f":"MAX(I:I)","v":1401},"maximum",{"$f":"reducefraction(JitterMax*MPC,MPC,FALSE,FALSE,FALSE)","v":"1401"}]
["Months per Cycle (Parts per Day):",940,"months (parts)",{"$f":"MIN(I:I)","v":-470},"minimum",{"$f":"reducefraction(JitterMin*MPC,MPC,FALSE,FALSE,FALSE)","v":"–(470)"}]
["30-day Months per Cycle:",499,"months",{"$f":"D4-D5","v":1871},"range",{"$f":"reducefraction(JitterRange*MPC,MPC,FALSE,FALSE,FALSE)","v":"1871"}]
["29-day Months per Cycle:",{"$f":"MPC-FMPC","v":441},"months",{"$f":"\"Jitter range = \"&F6&\" parts = \"&reducefraction(F6*24,MPC,FALSE,FALSE,FALSE)&\" hours\"","v":"Jitter range = 1871 parts = 47 + 181 / 235 hours"}]
["Days per Cycle (Parts per Month):",{"$f":"29*MPC+FMPC","v":27759},"days (parts)",null,"Years Per Cycle:",{"$f":"4*19","v":76}]
["Yerms per Cycle:",{"$f":"2*DPC-59*MPC","v":58},"yerms","Limits for Chart:"]
["Mean Month:",{"$f":"\"29 + \"&reducefraction(FMPC,MPC,FALSE,FALSE,FALSE)","v":"29 + 499 / 940"},"days","x","y","Hours"]
["Mean Month >29d:",{"$f":"FMPC/MPC","v":{"v":0.5308510638297872,"d":"0.530851063829787"}},"days",{"$f":"A22","v":1},{"$f":"JitterMax","v":1401},{"$f":"E11*24/MPC","v":35.770212765957446}]
["Mean Month >29d 12h 44m:",{"$f":"reducefraction(240*(360*FMPC-191*MPC),MPC,FALSE,FALSE,TRUE)","v":"25+25/47"},"seconds",{"$f":"7*YPC+1","v":533},{"$f":"E11","v":1401},{"$f":"E12*24/MPC","v":35.770212765957446}]
["… or approximately:",{"$f":"240*(360*FMPC-191*MPC)/MPC","v":25.53191489361702},"seconds"]
["Has Yerm Zero:",{"$f":"MeanMonth>26/49","v":true},null,{"$f":"D11","v":1},0]
["17-month Yerms per Cycle:",{"$f":"443*MPC-15*DPC","v":35},"yerms",{"$f":"D12","v":533},0]
["15-month Yerms per Cycle:",{"$f":"Yerms-n17my","v":23},"yerms"]
["49-month subcycles:",{"$f":"INT(Yerms/3)","v":19},null,{"$f":"A22","v":1},{"$f":"JitterMin","v":-470},{"$f":"E17*24/MPC","v":-12}]
["Duration per Part:",{"$f":"reducefraction(1440,MPC,FALSE,FALSE,FALSE)","v":"1 + 25 / 47"},"minutes",{"$f":"D12","v":533},{"$f":"E17","v":-470},{"$f":"E18*24/MPC","v":-12}]
[{"$nulls":6},"Elapsed","Elapsed"]
[{"$nulls":3},"Paschal Moon","Elapsed","Paschal Moon","Lunar","Mean Month","Difference"]
["Julian Year","isLeapYear","Year Length","(days)","Days","(parts)","Months","Parts","(parts)"]
[1,{"$f":"isJulianLeapYear(A22)","v":false},{"$f":"IF(B22,366,365)","v":365},{"$f":"PaschalMoon(A22)","v":82},null,0,null,0,{"$f":"F22-H22","v":0}]
[{"$f":"A22+1","v":2},{"$f":"isJulianLeapYear(A23)","v":false},{"$f":"IF(B23,366,365)","v":365},{"$f":"PaschalMoon(A23)","v":466},{"$f":"D23-D22","v":384},{"$f":"F22+(D23-D22)*PPD","v":360960},{"$f":"ROUND((D23-D22)/DecMeanMon,1)","v":13},{"$f":"H22+G23*PPM","v":360867},{"$f":"F23-H23","v":93}]
[{"$f":"A23+1","v":3},false,365,820,354,{"$f":"F23+(D24-D23)*PPD","v":693720},{"$f":"ROUND((D24-D23)/DecMeanMon,1)","v":12},{"$f":"H23+G24*PPM","v":693975},-255]
[4,true,366,1175,355,1027420,{"$f":"ROUND((D25-D24)/DecMeanMon,1)","v":12},1027083,337]
[5,false,365,1559,384,1388380,{"$f":"ROUND((D26-D25)/DecMeanMon,1)","v":13},1387950,430]
[6,false,365,1913,354,1721140,12,1721058,82]
[7,false,365,2297,384,2082100,13,2081925,175]
[8,true,366,2652,355,2415800,12,2415033,767]
[9,false,365,3006,354,2748560,12,2748141,419]
[10,false,365,3390,384,3109520,13,3109008,512]
[11,false,365,3744,354,3442280,12,3442116,164]
[12,true,366,4099,355,3775980,12,3775224,756]
[13,false,365,4483,384,4136940,13,4136091,849]
[14,false,365,4837,354,4469700,12,4469199,501]
[15,false,365,5191,354,4802460,12,4802307,153]
[16,true,366,5576,385,5164360,13,5163174,1186]
[17,false,365,5930,354,5497120,12,5496282,838]
[18,false,365,6314,384,5858080,13,5857149,931]
[19,false,365,6667,353,6189900,12,6190257,-357]
[20,true,366,7022,355,6523600,12,6523365,235]
[21,false,365,7406,384,6884560,13,6884232,328]
[22,false,365,7760,354,7217320,12,7217340,-20]
[23,false,365,8114,354,7550080,12,7550448,-368]
[24,true,366,8499,385,7911980,13,7911315,665]
[25,false,365,8853,354,8244740,12,8244423,317]
[26,false,365,9237,384,8605700,13,8605290,410]
[27,false,365,9591,354,8938460,12,8938398,62]
[28,true,366,9946,355,9272160,12,9271506,654]
[29,false,365,10330,384,9633120,13,9632373,747]
[30,false,365,10684,354,9965880,12,9965481,399]
[31,false,365,11038,354,10298640,12,10298589,51]
[32,true,366,11423,385,10660540,13,10659456,1084]
[33,false,365,11777,354,10993300,12,10992564,736]
[34,false,365,12131,{"$f":"D55-D54","v":354},11326060,12,11325672,388]
[35,false,365,12515,384,11687020,13,11686539,481]
[36,true,366,12870,355,12020720,12,12019647,1073]
[37,false,365,13254,384,12381680,13,12380514,1166]
[38,false,365,13607,353,12713500,12,12713622,-122]
[39,false,365,13961,354,13046260,12,13046730,-470]
[40,true,366,14346,385,13408160,13,13407597,563]
[41,false,365,14700,354,13740920,12,13740705,215]
[42,false,365,15054,354,14073680,12,14073813,-133]
[43,false,365,15438,384,14434640,13,14434680,-40]
[44,true,366,15793,355,14768340,12,14767788,552]
[45,false,365,16177,384,15129300,13,15128655,645]
[46,false,365,16531,354,15462060,12,15461763,297]
[47,false,365,16885,354,15794820,12,15794871,-51]
[48,true,366,17270,385,16156720,13,16155738,982]
[49,false,365,17624,354,16489480,12,16488846,634]
[50,false,365,17978,354,16822240,12,16821954,286]
[51,false,365,18362,384,17183200,13,17182821,379]
[52,true,366,18717,355,17516900,12,17515929,971]
[53,false,365,19071,354,17849660,12,17849037,623]
[54,false,365,19455,384,18210620,13,18209904,716]
[55,false,365,19809,354,18543380,12,18543012,368]
[56,true,366,20194,385,18905280,13,18903879,1401]
[57,false,365,20547,353,19237100,12,19236987,113]
[58,false,365,20901,354,19569860,12,19570095,-235]
[59,false,365,21285,384,19930820,13,19930962,-142]
[60,true,366,21640,355,20264520,12,20264070,450]
[61,false,365,21994,354,20597280,12,20597178,102]
[62,false,365,22378,384,20958240,13,20958045,195]
[63,false,365,22732,354,21291000,12,21291153,-153]
[64,true,366,23117,385,21652900,13,21652020,880]
[65,false,365,23471,354,21985660,12,21985128,532]
[66,{"$f":"isJulianLeapYear(A87)","v":false},{"$f":"IF(B87,366,365)","v":365},{"$f":"PaschalMoon(A87)","v":23825},{"$f":"D87-D86","v":354},22318420,12,22318236,{"$f":"F87-H87","v":184}]
[{"$f":"A87+1","v":67},false,365,{"$f":"PaschalMoon(A88)","v":24209},{"$f":"D88-D87","v":384},{"$f":"F87+(D88-D87)*PPD","v":22679380},{"$f":"ROUND((D88-D87)/DecMeanMon,1)","v":13},{"$f":"H87+G88*PPM","v":22679103},{"$f":"F88-H88","v":277}]
[{"$f":"A88+1","v":68},true,366,{"$f":"PaschalMoon(A89)","v":24564},{"$f":"D89-D88","v":355},{"$f":"F88+(D89-D88)*PPD","v":23013080},{"$f":"ROUND((D89-D88)/DecMeanMon,1)","v":12},{"$f":"H88+G89*PPM","v":23012211},{"$f":"F89-H89","v":869}]
[{"$f":"A89+1","v":69},false,365,{"$f":"PaschalMoon(A90)","v":24918},{"$f":"D90-D89","v":354},{"$f":"F89+(D90-D89)*PPD","v":23345840},{"$f":"ROUND((D90-D89)/DecMeanMon,1)","v":12},{"$f":"H89+G90*PPM","v":23345319},{"$f":"F90-H90","v":521}]
[{"$f":"A90+1","v":70},false,365,{"$f":"PaschalMoon(A91)","v":25302},{"$f":"D91-D90","v":384},{"$f":"F90+(D91-D90)*PPD","v":23706800},{"$f":"ROUND((D91-D90)/DecMeanMon,1)","v":13},{"$f":"H90+G91*PPM","v":23706186},{"$f":"F91-H91","v":614}]
[71,false,365,25656,354,24039560,12,24039294,266]
[72,true,366,26011,355,24373260,12,24372402,858]
[73,false,365,26395,384,24734220,13,24733269,951]
[74,false,365,26749,354,25066980,12,25066377,603]
[75,false,365,27133,384,25427940,13,25427244,696]
[76,true,366,27487,354,25760700,12,25760352,348]
[77,false,365,27841,354,26093460,12,26093460,0]
[78,false,365,28225,384,26454420,13,26454327,93]
[79,false,365,28579,354,26787180,12,26787435,-255]
[80,true,366,28934,355,27120880,12,27120543,337]
[81,false,365,29318,384,27481840,13,27481410,430]
[82,false,365,29672,354,27814600,12,27814518,82]
[83,false,365,30056,384,28175560,13,28175385,175]
[84,true,366,30411,355,28509260,12,28508493,767]
[85,false,365,30765,354,28842020,12,28841601,419]
[86,false,365,31149,384,29202980,13,29202468,512]
[87,false,365,31503,354,29535740,12,29535576,164]
[88,true,366,31858,355,29869440,12,29868684,756]
[89,false,365,32242,384,30230400,13,30229551,849]
[90,false,365,32596,354,30563160,12,30562659,501]
[91,false,365,32950,354,30895920,12,30895767,153]
[92,true,366,33335,385,31257820,13,31256634,1186]
[93,false,365,33689,354,31590580,12,31589742,838]
[94,false,365,34073,384,31951540,13,31950609,931]
[95,false,365,34426,353,32283360,12,32283717,-357]
[96,true,366,34781,355,32617060,12,32616825,235]
[97,false,365,35165,384,32978020,13,32977692,328]
[98,{"$f":"isJulianLeapYear(A119)","v":false},{"$f":"IF(B119,366,365)","v":365},35519,354,33310780,12,33310800,-20]
[99,false,365,35873,354,33643540,12,33643908,-368]
{"$rows_left_out":472}
{"sheet":"Solar Cycle","index":2,"n_rows":28,"n_cols":6,"rows_kept":28}
["Year in Solar Cycle","Solar Cycle","Paschal Moon","Elapsed","Difference","Top"]
[{"$f":"StartSolar","v":3},1,{"$f":"LOOKUP(A2,Data!A$22:A$591,Data!F$22:F$591)","v":693720},{"$f":"LOOKUP(A2,Data!A$22:A$591,Data!H$22:H$591)","v":693975},{"$f":"C2-D2","v":-255},1500]
[{"$f":"A2+28","v":31},{"$f":"MOD(B2,28)+1","v":2},{"$f":"LOOKUP(A3,Data!A$22:A$591,Data!F$22:F$591)","v":10298640},{"$f":"LOOKUP(A3,Data!A$22:A$591,Data!H$22:H$591)","v":10298589},{"$f":"C3-D3","v":51},{"$f":"F2","v":1500}]
[{"$f":"A3+28","v":59},{"$f":"MOD(B3,28)+1","v":3},{"$f":"LOOKUP(A4,Data!A$22:A$591,Data!F$22:F$591)","v":19930820},{"$f":"LOOKUP(A4,Data!A$22:A$591,Data!H$22:H$591)","v":19930962},{"$f":"C4-D4","v":-142},{"$f":"F3","v":1500}]
[87,4,{"$f":"LOOKUP(A5,Data!A$22:A$591,Data!F$22:F$591)","v":29535740},{"$f":"LOOKUP(A5,Data!A$22:A$591,Data!H$22:H$591)","v":29535576},164,1500]
[115,5,{"$f":"LOOKUP(A6,Data!A$22:A$591,Data!F$22:F$591)","v":39139720},{"$f":"LOOKUP(A6,Data!A$22:A$591,Data!H$22:H$591)","v":39140190},-470,1500]
[143,6,{"$f":"LOOKUP(A7,Data!A$22:A$591,Data!F$22:F$591)","v":48772840},{"$f":"LOOKUP(A7,Data!A$22:A$591,Data!H$22:H$591)","v":48772563},277,1500]
[171,7,{"$f":"LOOKUP(A8,Data!A$22:A$591,Data!F$22:F$591)","v":58376820},{"$f":"LOOKUP(A8,Data!A$22:A$591,Data!H$22:H$591)","v":58377177},-357,1500]
[199,8,{"$f":"LOOKUP(A9,Data!A$22:A$591,Data!F$22:F$591)","v":67981740},{"$f":"LOOKUP(A9,Data!A$22:A$591,Data!H$22:H$591)","v":67981791},-51,1500]
[227,9,{"$f":"LOOKUP(A10,Data!A$22:A$591,Data!F$22:F$591)","v":77614860},{"$f":"LOOKUP(A10,Data!A$22:A$591,Data!H$22:H$591)","v":77614164},696,1500]
[255,10,{"$f":"LOOKUP(A11,Data!A$22:A$591,Data!F$22:F$591)","v":87218840},{"$f":"LOOKUP(A11,Data!A$22:A$591,Data!H$22:H$591)","v":87218778},62,1500]
[283,11,{"$f":"LOOKUP(A12,Data!A$22:A$591,Data!F$22:F$591)","v":96823760},{"$f":"LOOKUP(A12,Data!A$22:A$591,Data!H$22:H$591)","v":96823392},368,1500]
[311,12,{"$f":"LOOKUP(A13,Data!A$22:A$591,Data!F$22:F$591)","v":106455940},{"$f":"LOOKUP(A13,Data!A$22:A$591,Data!H$22:H$591)","v":106455765},175,1500]
[339,13,{"$f":"LOOKUP(A14,Data!A$22:A$591,Data!F$22:F$591)","v":116060860},{"$f":"LOOKUP(A14,Data!A$22:A$591,Data!H$22:H$591)","v":116060379},481,1500]
[367,14,{"$f":"LOOKUP(A15,Data!A$22:A$591,Data!F$22:F$591)","v":125664840},{"$f":"LOOKUP(A15,Data!A$22:A$591,Data!H$22:H$591)","v":125664993},-153,1500]
[395,15,{"$f":"LOOKUP(A16,Data!A$22:A$591,Data!F$22:F$591)","v":135269760},{"$f":"LOOKUP(A16,Data!A$22:A$591,Data!H$22:H$591)","v":135269607},153,1500]
[423,16,{"$f":"LOOKUP(A17,Data!A$22:A$591,Data!F$22:F$591)","v":144901940},{"$f":"LOOKUP(A17,Data!A$22:A$591,Data!H$22:H$591)","v":144901980},-40,1500]
[451,17,{"$f":"LOOKUP(A18,Data!A$22:A$591,Data!F$22:F$591)","v":154506860},{"$f":"LOOKUP(A18,Data!A$22:A$591,Data!H$22:H$591)","v":154506594},266,1500]
[479,18,{"$f":"LOOKUP(A19,Data!A$22:A$591,Data!F$22:F$591)","v":164110840},{"$f":"LOOKUP(A19,Data!A$22:A$591,Data!H$22:H$591)","v":164111208},-368,1500]
[507,19,{"$f":"LOOKUP(A20,Data!A$22:A$591,Data!F$22:F$591)","v":173743960},{"$f":"LOOKUP(A20,Data!A$22:A$591,Data!H$22:H$591)","v":173743581},379,1500]
[535,20,{"$f":"LOOKUP(A21,Data!A$22:A$591,Data!F$22:F$591)","v":183347940},{"$f":"LOOKUP(A21,Data!A$22:A$591,Data!H$22:H$591)","v":183348195},-255,1500]
[563,21,{"$f":"LOOKUP(A22,Data!A$22:A$591,Data!F$22:F$591)","v":192952860},{"$f":"LOOKUP(A22,Data!A$22:A$591,Data!H$22:H$591)","v":192952809},51,1500]
[591,22,{"$f":"LOOKUP(A23,Data!A$22:A$591,Data!F$22:F$591)","v":195367720},{"$f":"LOOKUP(A23,Data!A$22:A$591,Data!H$22:H$591)","v":195367842},-122,1500]
[619,23,{"$f":"LOOKUP(A24,Data!A$22:A$591,Data!F$22:F$591)","v":195367720},{"$f":"LOOKUP(A24,Data!A$22:A$591,Data!H$22:H$591)","v":195367842},-122,1500]
[647,24,{"$f":"LOOKUP(A25,Data!A$22:A$591,Data!F$22:F$591)","v":195367720},{"$f":"LOOKUP(A25,Data!A$22:A$591,Data!H$22:H$591)","v":195367842},-122,1500]
[675,25,{"$f":"LOOKUP(A26,Data!A$22:A$591,Data!F$22:F$591)","v":195367720},{"$f":"LOOKUP(A26,Data!A$22:A$591,Data!H$22:H$591)","v":195367842},-122,1500]
[703,26,{"$f":"LOOKUP(A27,Data!A$22:A$591,Data!F$22:F$591)","v":195367720},{"$f":"LOOKUP(A27,Data!A$22:A$591,Data!H$22:H$591)","v":195367842},-122,1500]
[731,27,{"$f":"LOOKUP(A28,Data!A$22:A$591,Data!F$22:F$591)","v":195367720},{"$f":"LOOKUP(A28,Data!A$22:A$591,Data!H$22:H$591)","v":195367842},-122,1500]

{"sheet":"Lunar Cycle","index":3,"n_rows":36,"n_cols":6,"rows_kept":36}
["Year in Lunar Cycle","Lunar Cycle","Paschal Moon","Elapsed","Difference","Top"]
[{"$f":"StartLunar","v":18},1,{"$f":"LOOKUP(A2,Data!A$22:A$591,Data!F$22:F$591)","v":5858080},{"$f":"LOOKUP(A2,Data!A$22:A$591,Data!H$22:H$591)","v":5857149},{"$f":"C2-D2","v":931},1500]
[{"$f":"A2+19","v":37},{"$f":"MOD(B2,19)+1","v":2},{"$f":"LOOKUP(A3,Data!A$22:A$591,Data!F$22:F$591)","v":12381680},{"$f":"LOOKUP(A3,Data!A$22:A$591,Data!H$22:H$591)","v":12380514},{"$f":"C3-D3","v":1166},{"$f":"F2","v":1500}]
[{"$f":"A3+19","v":56},{"$f":"MOD(B3,19)+1","v":3},{"$f":"LOOKUP(A4,Data!A$22:A$591,Data!F$22:F$591)","v":18905280},{"$f":"LOOKUP(A4,Data!A$22:A$591,Data!H$22:H$591)","v":18903879},{"$f":"C4-D4","v":1401},{"$f":"F3","v":1500}]
[75,4,{"$f":"LOOKUP(A5,Data!A$22:A$591,Data!F$22:F$591)","v":25427940},{"$f":"LOOKUP(A5,Data!A$22:A$591,Data!H$22:H$591)","v":25427244},696,1500]
[94,5,{"$f":"LOOKUP(A6,Data!A$22:A$591,Data!F$22:F$591)","v":31951540},{"$f":"LOOKUP(A6,Data!A$22:A$591,Data!H$22:H$591)","v":31950609},931,1500]
[113,6,{"$f":"LOOKUP(A7,Data!A$22:A$591,Data!F$22:F$591)","v":38475140},{"$f":"LOOKUP(A7,Data!A$22:A$591,Data!H$22:H$591)","v":38473974},1166,1500]
[132,7,{"$f":"LOOKUP(A8,Data!A$22:A$591,Data!F$22:F$591)","v":44998740},{"$f":"LOOKUP(A8,Data!A$22:A$591,Data!H$22:H$591)","v":44997339},1401,1500]
[151,8,{"$f":"LOOKUP(A9,Data!A$22:A$591,Data!F$22:F$591)","v":51521400},{"$f":"LOOKUP(A9,Data!A$22:A$591,Data!H$22:H$591)","v":51520704},696,1500]
[170,9,{"$f":"LOOKUP(A10,Data!A$22:A$591,Data!F$22:F$591)","v":58045000},{"$f":"LOOKUP(A10,Data!A$22:A$591,Data!H$22:H$591)","v":58044069},931,1500]
[189,10,{"$f":"LOOKUP(A11,Data!A$22:A$591,Data!F$22:F$591)","v":64568600},{"$f":"LOOKUP(A11,Data!A$22:A$591,Data!H$22:H$591)","v":64567434},1166,1500]
[208,11,{"$f":"LOOKUP(A12,Data!A$22:A$591,Data!F$22:F$591)","v":71092200},{"$f":"LOOKUP(A12,Data!A$22:A$591,Data!H$22:H$591)","v":71090799},1401,1500]
[227,12,{"$f":"LOOKUP(A13,Data!A$22:A$591,Data!F$22:F$591)","v":77614860},{"$f":"LOOKUP(A13,Data!A$22:A$591,Data!H$22:H$591)","v":77614164},696,1500]
[246,13,{"$f":"LOOKUP(A14,Data!A$22:A$591,Data!F$22:F$591)","v":84138460},{"$f":"LOOKUP(A14,Data!A$22:A$591,Data!H$22:H$591)","v":84137529},931,1500]
[265,14,{"$f":"LOOKUP(A15,Data!A$22:A$591,Data!F$22:F$591)","v":90662060},{"$f":"LOOKUP(A15,Data!A$22:A$591,Data!H$22:H$591)","v":90660894},1166,1500]
[284,15,{"$f":"LOOKUP(A16,Data!A$22:A$591,Data!F$22:F$591)","v":97185660},{"$f":"LOOKUP(A16,Data!A$22:A$591,Data!H$22:H$591)","v":97184259},1401,1500]
[303,16,{"$f":"LOOKUP(A17,Data!A$22:A$591,Data!F$22:F$591)","v":103708320},{"$f":"LOOKUP(A17,Data!A$22:A$591,Data!H$22:H$591)","v":103707624},696,1500]
[322,17,{"$f":"LOOKUP(A18,Data!A$22:A$591,Data!F$22:F$591)","v":110231920},{"$f":"LOOKUP(A18,Data!A$22:A$591,Data!H$22:H$591)","v":110230989},931,1500]
[341,18,{"$f":"LOOKUP(A19,Data!A$22:A$591,Data!F$22:F$591)","v":116755520},{"$f":"LOOKUP(A19,Data!A$22:A$591,Data!H$22:H$591)","v":116754354},1166,1500]
[360,19,{"$f":"LOOKUP(A20,Data!A$22:A$591,Data!F$22:F$591)","v":123279120},{"$f":"LOOKUP(A20,Data!A$22:A$591,Data!H$22:H$591)","v":123277719},1401,1500]
[379,1,{"$f":"LOOKUP(A21,Data!A$22:A$591,Data!F$22:F$591)","v":129801780},{"$f":"LOOKUP(A21,Data!A$22:A$591,Data!H$22:H$591)","v":129801084},696,1500]
[398,2,{"$f":"LOOKUP(A22,Data!A$22:A$591,Data!F$22:F$591)","v":136325380},{"$f":"LOOKUP(A22,Data!A$22:A$591,Data!H$22:H$591)","v":136324449},931,1500]
[{"$f":"A22+19","v":417},{"$f":"MOD(B22,19)+1","v":3},{"$f":"LOOKUP(A23,Data!A$22:A$591,Data!F$22:F$591)","v":142848980},{"$f":"LOOKUP(A23,Data!A$22:A$591,Data!H$22:H$591)","v":142847814},{"$f":"C23-D23","v":1166},{"$f":"F22","v":1500}]
[436,4,{"$f":"LOOKUP(A24,Data!A$22:A$591,Data!F$22:F$591)","v":149372580},{"$f":"LOOKUP(A24,Data!A$22:A$591,Data!H$22:H$591)","v":149371179},1401,1500]
[455,5,{"$f":"LOOKUP(A25,Data!A$22:A$591,Data!F$22:F$591)","v":155895240},{"$f":"LOOKUP(A25,Data!A$22:A$591,Data!H$22:H$591)","v":155894544},696,1500]
[474,6,{"$f":"LOOKUP(A26,Data!A$22:A$591,Data!F$22:F$591)","v":162418840},{"$f":"LOOKUP(A26,Data!A$22:A$591,Data!H$22:H$591)","v":162417909},931,1500]
[493,7,{"$f":"LOOKUP(A27,Data!A$22:A$591,Data!F$22:F$591)","v":168942440},{"$f":"LOOKUP(A27,Data!A$22:A$591,Data!H$22:H$591)","v":168941274},1166,1500]
[512,8,{"$f":"LOOKUP(A28,Data!A$22:A$591,Data!F$22:F$591)","v":175466040},{"$f":"LOOKUP(A28,Data!A$22:A$591,Data!H$22:H$591)","v":175464639},1401,1500]
[531,9,{"$f":"LOOKUP(A29,Data!A$22:A$591,Data!F$22:F$591)","v":181988700},{"$f":"LOOKUP(A29,Data!A$22:A$591,Data!H$22:H$591)","v":181988004},696,1500]
[550,10,{"$f":"LOOKUP(A30,Data!A$22:A$591,Data!F$22:F$591)","v":188512300},{"$f":"LOOKUP(A30,Data!A$22:A$591,Data!H$22:H$591)","v":188511369},931,1500]
[569,11,{"$f":"LOOKUP(A31,Data!A$22:A$591,Data!F$22:F$591)","v":195035900},{"$f":"LOOKUP(A31,Data!A$22:A$591,Data!H$22:H$591)","v":195034734},1166,1500]
[588,12,{"$f":"LOOKUP(A32,Data!A$22:A$591,Data!F$22:F$591)","v":195367720},{"$f":"LOOKUP(A32,Data!A$22:A$591,Data!H$22:H$591)","v":195367842},-122,1500]
[607,13,{"$f":"LOOKUP(A33,Data!A$22:A$591,Data!F$22:F$591)","v":195367720},{"$f":"LOOKUP(A33,Data!A$22:A$591,Data!H$22:H$591)","v":195367842},-122,1500]
[626,14,{"$f":"LOOKUP(A34,Data!A$22:A$591,Data!F$22:F$591)","v":195367720},{"$f":"LOOKUP(A34,Data!A$22:A$591,Data!H$22:H$591)","v":195367842},-122,1500]
[645,15,{"$f":"LOOKUP(A35,Data!A$22:A$591,Data!F$22:F$591)","v":195367720},{"$f":"LOOKUP(A35,Data!A$22:A$591,Data!H$22:H$591)","v":195367842},-122,1500]
[664,16,{"$f":"LOOKUP(A36,Data!A$22:A$591,Data!F$22:F$591)","v":195367720},{"$f":"LOOKUP(A36,Data!A$22:A$591,Data!H$22:H$591)","v":195367842},-122,1500]

{"sheet":"Zoom","index":4,"n_rows":10,"n_cols":6,"rows_kept":10}
[1,"= Current Zoom Level"]
["Level","Years","MajorTick","MinorTick","Shift","Connect"]
[{"$f":"ROW()-3","v":0},532,76,19,null,false]
[1,532,76,19,null,true]
[2,{"$f":"B4/2","v":266},19,1,76,true]
[3,152,19,1,76,true]
[4,152,4,1,76,true]
[5,76,4,1,{"$f":"2*19","v":38},true]
[6,19,1,1,19,true]
[7,19,1,1,19,false]

{"sheet":"Labels","index":5,"n_rows":18,"n_cols":3,"rows_kept":18}
["Year","Hours",{"$f":"\"Span \"&B2-B18&\"h\"","v":"Span 48h"}]
[533,36]
[{"$f":"A2","v":533},{"$f":"B2-3","v":33}]
[{"$f":"A3","v":533},{"$f":"B3-3","v":30}]
[{"$f":"A4","v":533},27]
[{"$f":"A5","v":533},24]
[533,21]
[533,18]
[533,15]
[533,12]
[533,9]
[533,6]
[533,3]
[533,0]
[533,-3]
[533,-6]
[{"$f":"A16","v":533},-9]
[{"$f":"A17","v":533},-12]